n-Butyl-1,1,2,2-tetrafluoroethyl ether

Gas phase ion energetics data

Data compiled by: Sharon G. Lias, John E. Bartmess, Joel F. Liebman, John L. Holmes, Rhoda D. Levin, and W. Gary Mallard

Ionization energy determinations

IE (eV) Method Reference
10.78PEMolder, Pikver, et al., 1983

References

Molder, Pikver, et al., 1983
Molder, U.H.; Pikver, R.J.; Koppel, I.A., Photoelectron spectra of molecules. 2. Ethers, Org. React. (N.Y. Engl. Transl.), 1983, 20, 208. [all data]