Benzene,[2-(methylthio)ethenyl]-(Z)-
- Formula: C9H10S
- Molecular weight: 150.241
- IUPAC Standard InChIKey: BWRWWBWZSDMTFX-FPLPWBNLSA-N
- CAS Registry Number: 35822-50-5
- Chemical structure:
View 3d structure (requires JavaScript / HTML 5) - Permanent link for this species. Use this link for bookmarking this species for future reference.

Gas phase ion energetics data

Data compiled by: Sharon G. Lias, Rhoda D. Levin, and Sherif A. Kafafi
Ionization energy determinations
IE (eV) | Method | Reference | Comment |
---|---|---|---|
8.75 | PE | Bock, Wagner, et al., 1972 | Vertical value |
7.75 | PE | Bock and Wagner, 1972 | Vertical value |

References

Bock, Wagner, et al., 1972
Bock, H.; Wagner, G.; Kroner, J.,
Photoelektronenspektren und molekuleigenschaften, XIV. Die delokalisation des schwefel-elektronenpaar in CH3S-substituierten aromaten,
Chem. Ber., 1972, 105, 3850. [all data]
Bock and Wagner, 1972
Bock, H.; Wagner, G.,
Electron lone pairs in organic sulfides and disulfides,
Angew. Chem. Int. Ed. Engl., 1972, 11, 119. [all data]