Silane, diethyldifluoro-
- Formula: C4H10F2Si
- Molecular weight: 124.2045
- IUPAC Standard InChIKey: OJBGGLLCYJYHPG-UHFFFAOYSA-N
- CAS Registry Number: 358-06-5
- Chemical structure:
View 3d structure (requires JavaScript / HTML 5) - Other names: Diethyldifluorosilane

Gas phase ion energetics data

Data compiled by: Sharon G. Lias, Rhoda D. Levin, and Sherif A. Kafafi
Ionization energy determinations
IE (eV) | Method | Reference | Comment |
---|---|---|---|
10.5 | PE | Roberge, Sandorfy, et al., 1978 | Vertical value |

References

Roberge, Sandorfy, et al., 1978
Roberge, R.; Sandorfy, C.; Matthews, J.I.; Strausz, O.P.,
The far ultraviolet HeI photoelectron spectra of alkyl and fluorine substituted silane derivatives,
J. Chem. Phys., 1978, 69, 5105. [all data]