2,4-Cyclopentadien-1-yltrimethylsilane
- Formula: C8H14Si
- Molecular weight: 138.2823
- IUPAC Standard InChIKey: VMFHCJPMKUTMMQ-UHFFFAOYSA-N
- CAS Registry Number: 3559-74-8
- Chemical structure:
View 3d structure (requires JavaScript / HTML 5) - Other names: 5-Trimethylsilylcyclopentadiene; Silane, 2,4-cyclopentadien-1-yltrimethyl-; 5-(Trimethylsilyl)-1,3-cyclopentadiene; 1-Trimethylsilyl-2,4-cyclopentadiene; Cyclopenta-2,4-dienyl-trimethyl-silane; 1,3-Cyclopentadiene, 5-(trimethylsilyl)-; 5-(Trimethylsilyl)-1,3-cyclopentadien

Gas phase ion energetics data

Data compiled by: Sharon G. Lias, Rhoda D. Levin, and Sherif A. Kafafi
Ionization energy determinations
IE (eV) | Method | Reference | Comment |
---|---|---|---|
8.30 | PE | Bock and Kaim, 1980 | Vertical value |

References

Bock and Kaim, 1980
Bock, H.; Kaim, W.,
Radical ions. 37. Ionization and one-electron oxidation of electron-rich silylalkyl olefins,
J. Am. Chem. Soc., 1980, 102, 4429. [all data]