Cyclohexane, dodecafluoro-
- Formula: C6F12
- Molecular weight: 300.0450
- IUPAC Standard InChIKey: RKIMETXDACNTIE-UHFFFAOYSA-N
- CAS Registry Number: 355-68-0
- Chemical structure:
View 3d structure (requires JavaScript / HTML 5) - Other names: Dodecafluorocyclohexane; Perfluorocyclohexane

Condensed phase thermochemistry data

Data compiled by: Hussein Y. Afeefy, Joel F. Liebman, and Stephen E. Stein
Quantity | Value | Units | Method | Reference | Comment |
---|---|---|---|---|---|
ΔcH°liquid | -1330.8 ± 7.6 | kJ/mol | Ccb | Price and Sapiano, 1979 | Reanalyzed by Pedley, Naylor, et al., 1986, Original value = -1330.81 kJ/mol; hf_CF4=-933.0 kJ/mol |

Phase change data

Data compiled as indicated in comments:
ALS - Hussein Y. Afeefy, Joel F. Liebman, and Stephen E. Stein
AC - William E. Acree, Jr., James S. Chickos
Quantity | Value | Units | Method | Reference | Comment |
---|---|---|---|---|---|
ΔvapH° | 35.98 | kJ/mol | V | Price and Sapiano, 1979 | hf_CF4=-933.0 kJ/mol; ALS |
ΔvapH° | 36.0 | kJ/mol | N/A | Price and Sapiano, 1979 | Based on data from 274. to 322. K.; AC |
Enthalpy of vaporization
ΔvapH (kJ/mol) | Temperature (K) | Method | Reference | Comment |
---|---|---|---|---|
28.0 | 388. | N/A | Davies, Ewing, et al., 1988 | Based on data from 373. to 457. K.; AC |
28.1 | 365. | A | Stephenson and Malanowski, 1987 | Based on data from 350. to 451. K.; AC |
29.6 | 351. | N/A | McCullough, Douslin, et al., 1957 | Based on data from 336. to 394. K. See also Boublik, Fried, et al., 1984.; AC |
Antoine Equation Parameters
log10(P) = A − (B / (T + C))
P = vapor pressure (bar)
T = temperature (K)
View plot Requires a JavaScript / HTML 5 canvas capable browser.
Temperature (K) | A | B | C | Reference | Comment |
---|---|---|---|---|---|
350.32 to 451.01 | 4.20584 | 1212.323 | -34.221 | Crowder, Taylor, et al., 1967 | Coefficents calculated by NIST from author's data. |
292.96 to 394.5 | 3.18702 | 605.954 | -135.245 | Rowlinson and Thacker, 1957 | Coefficents calculated by NIST from author's data. |
Enthalpy of sublimation
ΔsubH (kJ/mol) | Temperature (K) | Method | Reference | Comment |
---|---|---|---|---|
36.4 | 267. | A | Stephenson and Malanowski, 1987 | Based on data from 252. to 326. K. See also Crowder, Taylor, et al., 1967.; AC |
36.2 | 313. | N/A | Rowlinson and Thacker, 1957, 2 | Based on data from 293. to 333. K.; AC |

Gas phase ion energetics data

Data compiled by: Henry M. Rosenstock, Keith Draxl, Bruce W. Steiner, and John T. Herron
Ionization energy determinations
IE (eV) | Method | Reference |
---|---|---|
13.2 | EI | Majer and Patrick, 1962 |

Gas phase thermochemistry data

Data compiled as indicated in comments:
ALS - Hussein Y. Afeefy, Joel F. Liebman, and Stephen E. Stein

Quantity Value Units Method Reference Comment
Δfgas-2471.kJ/molSemiStewart, 2004
Δfgas  CmAndreevskii and Antonova, 1982uncertain value: -2369. kJ/mol; ALS
Δfgas-2370.4 ± 8.4kJ/molCcbPrice and Sapiano, 1979Reanalyzed by Pedley, Naylor, et al., 1986, Original value = -2368.9 ± 7.6 kJ/mol; hf_CF4=-933.0 kJ/mol; ALS

Kovats' RI, non-polar column, isothermal

View large format table.

Column type Active phase Temperature (C) I Reference Comment
PackedSqualane50.278.Müller, Dietrich, et al., 1983
PackedApiezon L100.248.Brown, Chapman, et al., 1968N2, DCMS-treated Chromosorb W; Column length: 2.3 m

References

Price and Sapiano, 1979
Price, S.J.W.; Sapiano, H.J.,
Determination of ΔH°f298(C6F10,g) and ΔH°f298(C6F12,g) from studies of the combustion of decafluorocyclohexene and dodecafluorocylohexene in oxygen and calculation of the resonance energy of hexafluorobenzene,
Can. J. Chem., 1979, 58, 685-688. [all data]
Pedley, Naylor, et al., 1986
Pedley, J.B.; Naylor, R.D.; Kirby, S.P.,
Thermochemical Data of Organic Compounds, Chapman and Hall, New York, 1986, 1-792. [all data]
Davies, Ewing, et al., 1988
Davies, D.R.; Ewing, M.B.; Hugill, J.A.; McGlashan, M.L.,
The critical temperature, the critical pressure, and the dependence of vapour pressure on temperature for dodecafluorocyclohexane and hexafluorobenzene,
Can. J. Chem., 1988, 66, 4, 760-762, https://doi.org/10.1139/v88-131
. [all data]
Stephenson and Malanowski, 1987
Stephenson, Richard M.; Malanowski, Stanislaw,
Handbook of the Thermodynamics of Organic Compounds, 1987, https://doi.org/10.1007/978-94-009-3173-2
. [all data]
McCullough, Douslin, et al., 1957
McCullough, J.P.; Douslin, D.R.; Messerly, J.F.; Hossenlopp, I.A.; Kincheloe, T.C.; Waddington, G.,
Pyridine: experimental and calculated chemical thermodynamic properties between 0 and 1500 K., a revised vibrational assignment,
J. Am. Chem. Soc., 1957, 79, 4289-4295. [all data]
Boublik, Fried, et al., 1984
Boublik, T.; Fried, V.; Hala, E.,
The Vapour Pressures of Pure Substances: Selected Values of the Temperature Dependence of the Vapour Pressures of Some Pure Substances in the Normal and Low Pressure Region, 2nd ed., Elsevier, New York, 1984, 972. [all data]
Crowder, Taylor, et al., 1967
Crowder, Gene A.; Taylor, Zelma Lowell; Reed, Thomas McKennan; Young, John Adams,
Vapor pressures and triple point temperatures for several pure fluorocarbons,
J. Chem. Eng. Data, 1967, 12, 4, 481-485, https://doi.org/10.1021/je60035a005
. [all data]
Rowlinson and Thacker, 1957
Rowlinson, J.S.; Thacker, R.,
The Physical Properties of Some Fluorine Compounds and their Solutions. Part 3. Perfluorocyclohexane and Perfluoromethylcyclohexane,
Trans. Faraday Soc., 1957, 53, 1-8, https://doi.org/10.1039/tf9575300001
. [all data]
Rowlinson and Thacker, 1957, 2
Rowlinson, J.S.; Thacker, R.,
The physical properties of some fluorine compounds and their solutions. Part 3.?Perfluorocyclohexane and perfluoromethylcyclohexane,
Trans. Faraday Soc., 1957, 53, 1, https://doi.org/10.1039/tf9575300001
. [all data]
Majer and Patrick, 1962
Majer, J.R.; Patrick, C.R.,
Ionization potentials of perfluorocycloalkanes,
Nature, 1962, 193, 161. [all data]