Perfluoro-1-heptene
- Formula: C7F14
- Molecular weight: 350.0525
- IUPAC Standard InChIKey: CDAVUOSPHHTNBU-UHFFFAOYSA-N
- CAS Registry Number: 355-63-5
- Chemical structure:
View 3d structure (requires JavaScript / HTML 5) - Other names: 1-Heptene, 1,1,2,3,3,4,4,5,5,6,6,7,7,7-tetradecafluoro-; Tetradecafluoro-1-heptene; Perfluoro heptene-1; Hept-1-ene, perfluoro; perfluorohept-1-ene

Phase change data

Data compiled as indicated in comments:
BS - Robert L. Brown and Stephen E. Stein
TRC - Thermodynamics Research Center, NIST Boulder Laboratories, Chris Muzny director
Quantity | Value | Units | Method | Reference | Comment |
---|---|---|---|---|---|
Tboil | 353. to 355. | K | N/A | PCR Inc., 1990 | BS |
Tboil | 354. | K | N/A | Lazerte, Hals, et al., 1953 | Uncertainty assigned by TRC = 3. K; TRC |

Gas phase ion energetics data

Data compiled by: Henry M. Rosenstock, Keith Draxl, Bruce W. Steiner, and John T. Herron
Ionization energy determinations
IE (eV) | Method | Reference |
---|---|---|
10.48 ± 0.02 | PI | Watanabe, Nakayama, et al., 1962 |

Kovats' RI, non-polar column, isothermal

Column type | Active phase | Temperature (C) | I | Reference | Comment |
---|---|---|---|---|---|
Packed | Squalane | 50. | 312. | Müller, Dietrich, et al., 1983 |

References

PCR Inc., 1990
PCR Inc.,
Research Chemicals Catalog 1990-1991, PCR Inc., Gainesville, FL, 1990, 1. [all data]
Lazerte, Hals, et al., 1953
Lazerte, J.D.; Hals, L.J.; Ried, T.S.; Smith, G.H.,
Pyrolyses of the Salts of the Perfluoro Carboxylic Acids,
J. Am. Chem. Soc., 1953, 75, 4525. [all data]
Watanabe, Nakayama, et al., 1962
Watanabe, K.; Nakayama, T.; Mottl, J.,
Ionization potentials of some molecules,
J. Quant. Spectry. Radiative Transfer, 1962, 2, 369. [all data]
Müller, Dietrich, et al., 1983
Müller, U.; Dietrich, P.; Prescher, D.,
Gaschromatographische Untersuchungen an Perfluor-Carbonverbindungen. II. Zur Gaschromatographischen Trennung von Gemischen Längerkettiger Perfluoralkane und Perfluoralkene,
J. Chromatogr., 1983, 259, 243-254, https://doi.org/10.1016/S0021-9673(01)88005-5
. [all data]