1,2-Diiodotetrafluoroethane
- Formula: C2F4I2
- Molecular weight: 353.8240
- IUPAC Standard InChIKey: NZXVPCQHQVWOFD-UHFFFAOYSA-N
- CAS Registry Number: 354-65-4
- Chemical structure:
View 3d structure (requires JavaScript / HTML 5) - Other names: 1,1,2,2-tetrafluoro-1,2-diiodoethane

Gas phase thermochemistry data

Data compiled by: Hussein Y. Afeefy, Joel F. Liebman, and Stephen E. Stein
Quantity | Value | Units | Method | Reference | Comment |
---|---|---|---|---|---|
ΔfH°gas | -667. ± 3. | kJ/mol | Eqk | Wu, Pickard, et al., 1975 | Reanalyzed by Kolesov and Papina, 1983, Original value = -666. ± 2. kJ/mol; Spectrophotometery at 298.15°K |

Phase change data

Data compiled as indicated in comments:
BS - Robert L. Brown and Stephen E. Stein
TRC - Thermodynamics Research Center, NIST Boulder Laboratories, Chris Muzny director
Quantity | Value | Units | Method | Reference | Comment |
---|---|---|---|---|---|
Tboil | 385. to 386. | K | N/A | PCR Inc., 1990 | BS |
Tboil | 386. | K | N/A | Emeleus and Hazeldine, 1949 | Uncertainty assigned by TRC = 2. K; TRC |

Reaction thermochemistry data

Data compiled by: Hussein Y. Afeefy, Joel F. Liebman, and Stephen E. Stein
Individual Reactions
By formula: C2F4I2 = C2F4 + I2
Quantity | Value | Units | Method | Reference | Comment |
---|---|---|---|---|---|
ΔrH° | 69. ± 2. | kJ/mol | Eqk | Wu, Pickard, et al., 1975 | gas phase; Spectrophotometery at 298.15°K |

Gas phase ion energetics data

Data compiled by: Sharon G. Lias, Rhoda D. Levin, and Sherif A. Kafafi
Ionization energy determinations
IE (eV) | Method | Reference | Comment |
---|---|---|---|
10.11 ± 0.01 | PE | Chau and McDowell, 1976 | Vertical value |

Kovats' RI, non-polar column, isothermal

Column type | Active phase | Temperature (C) | I | Reference | Comment |
---|---|---|---|---|---|
Capillary | OV-101 | 140. | 790. | Boneva and Kotov, 1988 | Column length: 100. m; Column diameter: 0.27 mm |
Capillary | OV-101 | 150. | 791. | Boneva and Kotov, 1988 | Column length: 100. m; Column diameter: 0.27 mm |
Capillary | OV-101 | 160. | 794. | Boneva and Kotov, 1988 | Column length: 100. m; Column diameter: 0.27 mm |

References

Wu, Pickard, et al., 1975
Wu, E.C.; Pickard, J.M.; Rodgers, A.S.,
Thermochemistry of the gas-phase reaction tetrafluoroethylene + iodine = 1,2-diiodoperfluoroethane. Heat of formation of 1,2-diiodoperfluoroethane and of iodoperfluoroethane,
J. Phys. Chem., 1975, 79, 1078-1081. [all data]
Kolesov and Papina, 1983
Kolesov, V.P.; Papina, T.S.,
Thermochemistry of Haloethanes,
Russ. Chem. Rev., 1983, 52, 425. [all data]
PCR Inc., 1990
PCR Inc.,
Research Chemicals Catalog 1990-1991, PCR Inc., Gainesville, FL, 1990, 1. [all data]
Emeleus and Hazeldine, 1949
Emeleus, H.J.; Hazeldine, R.N.,
Organometallic Fluorine Compounds I. The Synthesis of Trifluoromethyl and Pentafluoroethyl Mercurides,
J. Chem. Soc., 1949, 1949, 2948. [all data]
Chau and McDowell, 1976
Chau, F.T.; McDowell, C.A.,
Photoelectron spectra of 1,2-dibromo-1,1-difluoroethane, 1,2-bromochloroethane, and 1,2-dichloro-, 1,2-dibromo-, and 1,2-diiodotetrafluoroethane,
J. Phys. Chem., 1976, 80, 2923. [all data]
Boneva and Kotov, 1988
Boneva, S.; Kotov, St.,
Separation and Identification of α,ω-Diidoperfluoroalkanes in Gas Chromatography,
Chromatographia, 1988, 25, 8, 735-736, https://doi.org/10.1007/BF02290482
. [all data]