Pentafluoroethyliodide
- Formula: C2F5I
- Molecular weight: 245.9179
- IUPAC Standard InChIKey: UXPOJVLZTPGWFX-UHFFFAOYSA-N
- CAS Registry Number: 354-64-3
- Chemical structure:
View 3d structure (requires JavaScript / HTML 5) - Other names: C2F5I; Perfluoroethyl iodide; Iodoperfluoroethane; Ethane, pentafluoroiodo-; Ethane, iodopentafluoro-; pentafluoroiodoethane

Phase change data

Data compiled as indicated in comments:
BS - Robert L. Brown and Stephen E. Stein
AC - William E. Acree, Jr., James S. Chickos
Quantity | Value | Units | Method | Reference | Comment |
---|---|---|---|---|---|
Tboil | 285.7 | K | N/A | Aldrich Chemical Company Inc., 1990 | BS |
Tboil | 285. to 286. | K | N/A | Farchan Laboratories, 1990 | BS |
Tboil | 285. to 286. | K | N/A | PCR Inc., 1990 | BS |
Enthalpy of vaporization
ΔvapH (kJ/mol) | Temperature (K) | Method | Reference | Comment |
---|---|---|---|---|
20.8 | 268. | A | Stephenson and Malanowski, 1987 | Based on data from 248. to 283. K.; AC |

Gas phase ion energetics data

Data compiled as indicated in comments:
LL - Sharon G. Lias and Joel F. Liebman
LLK - Sharon G. Lias, Rhoda D. Levin, and Sherif A. Kafafi
Ionization energy determinations
IE (eV) | Method | Reference | Comment |
---|---|---|---|
10.7 ± 0.1 | EI | Hsieh and Hanrahan, 1977 | LLK |
10.44 | PE | Golovin, Akopyan, et al., 1989 | Vertical value; LL |
Appearance energy determinations
Ion | AE (eV) | Other Products | Method | Reference | Comment |
---|---|---|---|---|---|
CF2I+ | 13.8 ± 0.1 | ? | PIPECO | Golovin, Akopyan, et al., 1989 | LL |
CF3+ | 13.7 ± 0.05 | CF2+I | PIPECO | Golovin, Akopyan, et al., 1989 | LL |
CF3+ | 13.7 ± 0.1 | CF2,I | EI | Hsieh and Hanrahan, 1977 | LLK |
C2F4I+ | 15.0 ± 0.1 | F | PIPECO | Golovin, Akopyan, et al., 1989 | LL |
C2F5+ | 11.0 ± 0.1 | I | EI | Golovin, Akopyan, et al., 1989 | LL |
C2F5+ | 11.2 ± 0.1 | I | PIPECO | Golovin, Akopyan, et al., 1989 | LL |
C2F5+ | 11.7 ± 0.1 | I | EI | Hsieh and Hanrahan, 1977 | LLK |
I+ | 13.8 ± 0.1 | ? | PIPECO | Golovin, Akopyan, et al., 1989 | LL |

References

Aldrich Chemical Company Inc., 1990
Aldrich Chemical Company Inc.,
Catalog Handbook of Fine Chemicals, Aldrich Chemical Company, Inc., Milwaukee WI, 1990, 1. [all data]
Farchan Laboratories, 1990
Farchan Laboratories,
Research Chemicals Catalog, Farchan Laboratories, Gainesville, FL, 1990, 91. [all data]
PCR Inc., 1990
PCR Inc.,
Research Chemicals Catalog 1990-1991, PCR Inc., Gainesville, FL, 1990, 1. [all data]
Stephenson and Malanowski, 1987
Stephenson, Richard M.; Malanowski, Stanislaw,
Handbook of the Thermodynamics of Organic Compounds, 1987, https://doi.org/10.1007/978-94-009-3173-2
. [all data]
Hsieh and Hanrahan, 1977
Hsieh, T.; Hanrahan, R.J.,
An electron impact investigation of pentafluoroethyl iodide,
Int. J. Mass Spectrom. Ion Phys., 1977, 23, 201. [all data]
Golovin, Akopyan, et al., 1989
Golovin, A.V.; Akopyan, M.E.; Reingand, L.M.; Chistyakov, A.B.,
Energetics and mechanism of C2F5I photoionization processes,
High Energy Chem., 1989, 23, 301, In original 387. [all data]