(α,α,α-Tris(trimethylsilyl)ethylbenzene
- Formula: C17H34Si3
- Molecular weight: 322.7084
- IUPAC Standard InChIKey: RRMMCVWTYVTPKU-UHFFFAOYSA-N
- CAS Registry Number: 35449-08-2
- Chemical structure:
View 3d structure (requires JavaScript / HTML 5) - Permanent link for this species. Use this link for bookmarking this species for future reference.

Gas phase ion energetics data

Data compiled by: Henry M. Rosenstock, Keith Draxl, Bruce W. Steiner, and John T. Herron
Ionization energy determinations
IE (eV) | Method | Reference |
---|---|---|
8.22 ± 0.04 | EI | Bock, Seidl, et al., 1968 |

References

Bock, Seidl, et al., 1968
Bock, H.; Seidl, H.; Fochler, M.,
d-Orbitaleffekte in silicium-substituierten π-Elektronensystemen. X. Vertikale Ionisierungsenergien von Alkyl- und Silyl-benzolen,
Chem. Ber., 1968, 101, 2815. [all data]