4-Aminobenzyl cyanide
- Formula: C8H8N2
- Molecular weight: 132.1625
- IUPAC Standard InChIKey: YCWRFIYBUQBHJI-UHFFFAOYSA-N
- CAS Registry Number: 3544-25-0
- Chemical structure:
View 3d structure (requires JavaScript / HTML 5) - Other names: 4-Aminophenylacetonitrile; p-Aminobenzyl cyanide; p-Aminophenylacetonitrile; Benzeneacetonitrile, 4-amino-; 4-Aminophenylacetic acid nitrile

Phase change data

Data compiled by: Robert L. Brown and Stephen E. Stein
Quantity | Value | Units | Method | Reference | Comment |
---|---|---|---|---|---|
Tboil | 585.2 | K | N/A | Weast and Grasselli, 1989 |
Reduced pressure boiling point
Tboil (K) | Pressure (bar) | Reference |
---|---|---|
450.2 | 0.015 | Weast and Grasselli, 1989 |

Gas phase ion energetics data

Data compiled by: Henry M. Rosenstock, Keith Draxl, Bruce W. Steiner, and John T. Herron
Ionization energy determinations
IE (eV) | Method | Reference |
---|---|---|
8.26 ± 0.04 | EI | Buchs, 1970 |

References

Weast and Grasselli, 1989
CRC Handbook of Data on Organic Compounds, 2nd Editon, Weast,R.C and Grasselli, J.G., ed(s)., CRC Press, Inc., Boca Raton, FL, 1989, 1. [all data]
Buchs, 1970
Buchs, A.,
Etude par spectrometrie de masse de l'ionisation de benzonitriles, de phenylacetonitriles et de N,N-dimethylanilines substitues,
Helv. Chim. Acta, 1970, 53, 2026. [all data]