Ethane, 1,2-dichloro-1,1,2-trifluoro-
- Formula: C2HCl2F3
- Molecular weight: 152.931
- IUPAC Standard InChIKey: YMRMDGSNYHCUCL-UHFFFAOYSA-N
- CAS Registry Number: 354-23-4
- Chemical structure:
View 3d structure (requires JavaScript / HTML 5) - Other names: 1,2-Dichloro-1,1,2-trifluoroethane; CF2ClCHFCl; 1,2-Dichlorotrifluoroethane; 1,1,2-Trifluoro-1,2-dichloroethane

Phase change data

Data compiled as indicated in comments:
BS - Robert L. Brown and Stephen E. Stein
TRC - Thermodynamics Research Center, NIST Boulder Laboratories, Chris Muzny director
AC - William E. Acree, Jr., James S. Chickos
Quantity | Value | Units | Method | Reference | Comment |
---|---|---|---|---|---|
Tboil | 301. | K | N/A | PCR Inc., 1990 | BS |
Tboil | 301.4 | K | N/A | Park, Lycan, et al., 1951 | Uncertainty assigned by TRC = 1. K; TRC |
Quantity | Value | Units | Method | Reference | Comment |
ΔvapH° | 26.8 ± 0.3 | kJ/mol | N/A | Varushchenko and Druzhinina, 2002 | AC |
Enthalpy of fusion
ΔfusH (kJ/mol) | Temperature (K) | Reference | Comment |
---|---|---|---|
7.08 | 135.7 | Druzhinina and Varushchenko, 1999 | AC |

Gas phase ion energetics data

Data compiled as indicated in comments:
LLK - Sharon G. Lias, Rhoda D. Levin, and Sherif A. Kafafi
Ionization energy determinations
IE (eV) | Method | Reference | Comment |
---|---|---|---|
12.00 | PE | Doucet, Sauvageau, et al., 1975 | Vertical value; LLK |

References

PCR Inc., 1990
PCR Inc.,
Research Chemicals Catalog 1990-1991, PCR Inc., Gainesville, FL, 1990, 1. [all data]
Park, Lycan, et al., 1951
Park, J.D.; Lycan, W.R.; Lacher, J.R.,
The Addition Productsw of Trifluoroethylene,
J. Am. Chem. Soc., 1951, 73, 711-2. [all data]
Varushchenko and Druzhinina, 2002
Varushchenko, R.M.; Druzhinina, A.I.,
Low-temperature heat capacity and thermodynamic properties of 1,1,1-trifluoro-2,2-dichloroethane,
Fluid Phase Equilibria, 2002, 199, 1-2, 109-119, https://doi.org/10.1016/S0378-3812(02)00003-1
. [all data]
Druzhinina and Varushchenko, 1999
Druzhinina, A.I.; Varushchenko, R.M.,
Low-temperature heat capacity and thermodynamic properties of 1,1,2-trifluoro-1,2-dichloroethane,
Zh. Fiz. Khim., 1999, 73, 9, 1531. [all data]
Doucet, Sauvageau, et al., 1975
Doucet, J.; Sauvageau, P.; Sandorfy, C.,
Photoelectron far-ultraviolet absorption spectra of chlorofluoro derivatives of ethane,
J. Chem. Phys., 1975, 62, 355. [all data]