1,1,1-Trifluoro-2-iodoethane
- Formula: C2H2F3I
- Molecular weight: 209.9370
- IUPAC Standard InChIKey: RKOUFQLNMRAACI-UHFFFAOYSA-N
- CAS Registry Number: 353-83-3
- Chemical structure:
View 3d structure (requires JavaScript / HTML 5) - Other names: 2,2,2-Trifluoroethyl iodide; CF3CH2I; 2-Iodo-1,1,1-trifluoroethane; Trifluoroethyl iodide; 1H,1H-Perfluoroethyl iodide; Ethane, 1,1,1-trifluoro-2-iodo-; 1,1,1-trifluoroiodoethane

Gas phase thermochemistry data

Data compiled by: Hussein Y. Afeefy, Joel F. Liebman, and Stephen E. Stein
Quantity | Value | Units | Method | Reference | Comment |
---|---|---|---|---|---|
ΔfH°gas | -648.7 ± 3.9 | kJ/mol | Eqk | Wu and Rodgers, 1974 | Reanalyzed by Kolesov and Papina, 1983, Original value = -646. ± 3. kJ/mol |

Phase change data

Data compiled by: Robert L. Brown and Stephen E. Stein
Quantity | Value | Units | Method | Reference | Comment |
---|---|---|---|---|---|
Tboil | 328. to 329. | K | N/A | PCR Inc., 1990 | |
Tboil | 327.7 | K | N/A | Weast and Grasselli, 1989 |

Reaction thermochemistry data

Data compiled by: Hussein Y. Afeefy, Joel F. Liebman, and Stephen E. Stein
Individual Reactions
By formula: C2H3F3 + I2 = HI + C2H2F3I
Quantity | Value | Units | Method | Reference | Comment |
---|---|---|---|---|---|
ΔrH° | -64. ± 2. | kJ/mol | Eqk | Wu and Rodgers, 1974 | gas phase; Heat of formation Unpublished results by B.J. Zwolinski |
By formula: C2H2BrF3 + I2 = C2H2F3I + BrI
Quantity | Value | Units | Method | Reference | Comment |
---|---|---|---|---|---|
ΔrH° | 28. ± 2. | kJ/mol | Eqk | Buckley, Ford, et al., 1980 | gas phase; GLC;hf298_gas[kcal/mol]=-166.8±1.1; Kolesov and Papina, 1983 |

Gas phase ion energetics data

Data compiled as indicated in comments:
LLK - Sharon G. Lias, Rhoda D. Levin, and Sherif A. Kafafi
RDSH - Henry M. Rosenstock, Keith Draxl, Bruce W. Steiner, and John T. Herron
Ionization energy determinations
IE (eV) | Method | Reference | Comment |
---|---|---|---|
9.998 | S | Boschi and Salahub, 1972 | LLK |
10.00 ± 0.01 | PI | Watanabe, Nakayama, et al., 1962 | RDSH |

References

Wu and Rodgers, 1974
Wu, E.; Rodgers, A.S.,
Thermochemistry of gas-phase equilibrium CF3CH3 + I2 = CF3CH2I + HI. The carbon-hydrogen bond dissociation energy in 1,1,1-trifluoroethane and the heat of formation of the 2,2,2-trifluoroethyl radical,
J. Phys. Chem., 1974, 78, 2315-2317. [all data]
Kolesov and Papina, 1983
Kolesov, V.P.; Papina, T.S.,
Thermochemistry of Haloethanes,
Russ. Chem. Rev., 1983, 52, 425. [all data]
PCR Inc., 1990
PCR Inc.,
Research Chemicals Catalog 1990-1991, PCR Inc., Gainesville, FL, 1990, 1. [all data]
Weast and Grasselli, 1989
CRC Handbook of Data on Organic Compounds, 2nd Editon, Weast,R.C and Grasselli, J.G., ed(s)., CRC Press, Inc., Boca Raton, FL, 1989, 1. [all data]
Buckley, Ford, et al., 1980
Buckley, G.S.; Ford, W.G.F.; Rodgers, A.S.,
The thermochemistry of the gas phase reaction: CF3CH2Br + I2 = CF3CH2I + IBr. Polarity effects in thermochemistry,
Thermochim. Acta, 1980, 42, 349-355. [all data]
Boschi and Salahub, 1972
Boschi, R.A.; Salahub, D.R.,
The far ultra-violet spectra of some branched chain iodo-alkanes, iodo-cycloalkanes, fluoro-iodoalkanes and iodo-alkenes,
Mol. Phys., 1972, 24, 735. [all data]
Watanabe, Nakayama, et al., 1962
Watanabe, K.; Nakayama, T.; Mottl, J.,
Ionization potentials of some molecules,
J. Quant. Spectry. Radiative Transfer, 1962, 2, 369. [all data]