Silane, difluorodimethyl-
- Formula: C2H6F2Si
- Molecular weight: 96.1513
- IUPAC Standard InChIKey: XRRDNAZMVAXXQP-UHFFFAOYSA-N
- CAS Registry Number: 353-66-2
- Chemical structure:
View 3d structure (requires JavaScript / HTML 5) - Other names: Difluorodimethylsilane; Dimethyldifluorosilane; (CH3)2SiF2

Reaction thermochemistry data

Data compiled as indicated in comments:
B - John E. Bartmess
M - Michael M. Meot-Ner (Mautner) and Sharon G. Lias
Individual Reactions
By formula: CN- + C2H6F2Si = (CN- • C2H6F2Si)
Quantity | Value | Units | Method | Reference | Comment |
---|---|---|---|---|---|
ΔrH° | 70.3 ± 4.2 | kJ/mol | IMRE | Larson, Szulejko, et al., 1988 | gas phase; B,M |
Quantity | Value | Units | Method | Reference | Comment |
ΔrS° | 130. | J/mol*K | N/A | Larson, Szulejko, et al., 1988 | gas phase; switching reaction,Thermochemical ladder(CN-)H2O, Entropy change calculated or estimated; Payzant, Yamdagni, et al., 1971; M |
C2H5F2Si- + =
By formula: C2H5F2Si- + H+ = C2H6F2Si
Quantity | Value | Units | Method | Reference | Comment |
---|---|---|---|---|---|
ΔrH° | 1590. ± 19. | kJ/mol | G+TS | Allison and McMahon, 1990 | gas phase; Between PhCH3, HCF3; B |
Quantity | Value | Units | Method | Reference | Comment |
ΔrG° | 1554. ± 19. | kJ/mol | IMRB | Allison and McMahon, 1990 | gas phase; Between PhCH3, HCF3; B |
By formula: F- + C2H6F2Si = (F- • C2H6F2Si)
Quantity | Value | Units | Method | Reference | Comment |
---|---|---|---|---|---|
ΔrH° | 232. ± 21. | kJ/mol | IMRB | Murphy and Beauchamp, 1977 | gas phase; Fluoride Affinity: SF4<Me2SiF2<Me3B; B |

Gas phase ion energetics data

Data compiled as indicated in comments:
B - John E. Bartmess
LLK - Sharon G. Lias, Rhoda D. Levin, and Sherif A. Kafafi
Ionization energy determinations
IE (eV) | Method | Reference | Comment |
---|---|---|---|
11.03 ± 0.03 | PI | Murphy and Beauchamp, 1977, 2 | LLK |
11.5 | PE | Roberge, Sandorfy, et al., 1978 | Vertical value; LLK |
Appearance energy determinations
Ion | AE (eV) | Other Products | Method | Reference | Comment |
---|---|---|---|---|---|
CH3F2Si+ | 11.70 ± 0.03 | CH3 | PI | Murphy and Beauchamp, 1977, 2 | LLK |
De-protonation reactions
C2H5F2Si- + =
By formula: C2H5F2Si- + H+ = C2H6F2Si
Quantity | Value | Units | Method | Reference | Comment |
---|---|---|---|---|---|
ΔrH° | 1590. ± 19. | kJ/mol | G+TS | Allison and McMahon, 1990 | gas phase; Between PhCH3, HCF3; B |
Quantity | Value | Units | Method | Reference | Comment |
ΔrG° | 1554. ± 19. | kJ/mol | IMRB | Allison and McMahon, 1990 | gas phase; Between PhCH3, HCF3; B |

Ion clustering data

Data compiled as indicated in comments:
B - John E. Bartmess
M - Michael M. Meot-Ner (Mautner) and Sharon G. Lias
Clustering reactions
By formula: CN- + C2H6F2Si = (CN- • C2H6F2Si)
Quantity | Value | Units | Method | Reference | Comment |
---|---|---|---|---|---|
ΔrH° | 70.3 ± 4.2 | kJ/mol | IMRE | Larson, Szulejko, et al., 1988 | gas phase; B,M |
Quantity | Value | Units | Method | Reference | Comment |
ΔrS° | 130. | J/mol*K | N/A | Larson, Szulejko, et al., 1988 | gas phase; switching reaction,Thermochemical ladder(CN-)H2O, Entropy change calculated or estimated; Payzant, Yamdagni, et al., 1971; M |
By formula: F- + C2H6F2Si = (F- • C2H6F2Si)
Quantity | Value | Units | Method | Reference | Comment |
---|---|---|---|---|---|
ΔrH° | 232. ± 21. | kJ/mol | IMRB | Murphy and Beauchamp, 1977 | gas phase; Fluoride Affinity: SF4<Me2SiF2<Me3B; B |

References

Larson, Szulejko, et al., 1988
Larson, J.W.; Szulejko, J.E.; McMahon, T.B.,
Gas Phase Lewis Acid-Base Interactions. An Experimental Determination of Cyanide Binding Energies From Ion Cyclotron Resonance and High-Pressure Mass Spectrometric Equilibrium Measurements.,
J. Am. Chem. Soc., 1988, 110, 23, 7604, https://doi.org/10.1021/ja00231a004
. [all data]
Payzant, Yamdagni, et al., 1971
Payzant, J.D.; Yamdagni, R.; Kebarle, P.,
Hydration of CN-, NO2-, NO3-, and HO- in the gas phase,
Can. J. Chem., 1971, 49, 3308. [all data]
Allison and McMahon, 1990
Allison, C.E.; McMahon, T.B.,
How Strong is the Si=C Bond in Fluoro- and Methyl Substituted Silaethylenes? An Experimental Determination of Pi Bond Strengths,
J. Am. Chem. Soc., 1990, 112, 5, 1672, https://doi.org/10.1021/ja00161a002
. [all data]
Murphy and Beauchamp, 1977
Murphy, M.K.; Beauchamp, J.L.,
Methyl and Fluorine Substituent Effects on the Gas Phase Lewis Acidities of Silanes by ICR Spectroscopy,
J. Am. Chem. Soc., 1977, 99, 15, 4992, https://doi.org/10.1021/ja00457a017
. [all data]
Murphy and Beauchamp, 1977, 2
Murphy, M.K.; Beauchamp, J.L.,
Photoionization mass spectrometry of the fluoromethylsilanes (CH3)n F4-nSi (n = 1-4),
J. Am. Chem. Soc., 1977, 99, 2085. [all data]
Roberge, Sandorfy, et al., 1978
Roberge, R.; Sandorfy, C.; Matthews, J.I.; Strausz, O.P.,
The far ultraviolet HeI photoelectron spectra of alkyl and fluorine substituted silane derivatives,
J. Chem. Phys., 1978, 69, 5105. [all data]