Bromochlorodifluoromethane
- Formula: CBrClF2
- Molecular weight: 165.365
- IUPAC Standard InChIKey: MEXUFEQDCXZEON-UHFFFAOYSA-N
- CAS Registry Number: 353-59-3
- Chemical structure:
View 3d structure (requires JavaScript / HTML 5) - Other names: Methane, bromochlorodifluoro-; Difluorochlorobromomethane; Fluorocarbon 1211; Freon 12B1; Halon 1211; R 12 B1; CF2BrCl; Chlorodifluoromonobromomethane; BCF; Chlorodifluorobromomethane; Flugex 12B1; UN 1974; Chlorobromodifluoromethane; Daiflon 12B1

Phase change data

Data compiled as indicated in comments:
BS - Robert L. Brown and Stephen E. Stein
AC - William E. Acree, Jr., James S. Chickos
Quantity | Value | Units | Method | Reference | Comment |
---|---|---|---|---|---|
Tboil | 270.6 | K | N/A | PCR Inc., 1990 | BS |
Enthalpy of vaporization
ΔvapH (kJ/mol) | Temperature (K) | Method | Reference | Comment |
---|---|---|---|---|
23.0 | 283. | A | Stephenson and Malanowski, 1987 | Based on data from 268. to 324. K.; AC |
23.1 | 272. | A | Stephenson and Malanowski, 1987 | Based on data from 194. to 287. K.; AC |
22.4 | 336. | A | Stephenson and Malanowski, 1987 | Based on data from 321. to 403. K.; AC |
23.1 | 415. | A | Stephenson and Malanowski, 1987 | Based on data from 403. to 427. K.; AC |
26.0 | 193. | N/A | Kudchadker, Kudchadker, et al., 1979 | Based on data from 178. to 283. K.; AC |
18.7 | 268. | N/A | Glew, 1960 | Based on data from 178. to 283. K. See also Boublik, Fried, et al., 1984.; AC |
Antoine Equation Parameters
log10(P) = A − (B / (T + C))
P = vapor pressure (bar)
T = temperature (K)
View plot Requires a JavaScript / HTML 5 canvas capable browser.
Temperature (K) | A | B | C | Reference | Comment |
---|---|---|---|---|---|
177.82 to 283.04 | 3.9640 | 936.27 | -32.659 | Glew, 1960 | Coefficents calculated by NIST from author's data. |

Gas phase ion energetics data

Data compiled as indicated in comments:
LBLHLM - Sharon G. Lias, John E. Bartmess, Joel F. Liebman, John L. Holmes, Rhoda D. Levin, and W. Gary Mallard
LLK - Sharon G. Lias, Rhoda D. Levin, and Sherif A. Kafafi
Ionization energy determinations
IE (eV) | Method | Reference | Comment |
---|---|---|---|
11.21 ± 0.02 | PI | Wang and Leroi, 1983 | LBLHLM |
11.83 | PE | Doucet, Gilbert, et al., 1975 | Vertical value; LLK |

Normal alkane RI, non-polar column, custom temperature program

Column type | Active phase | I | Reference | Comment |
---|---|---|---|---|
Capillary | SPB-1 | 398. | Flanagan, Streete, et al., 1997 | 60. m/0.53 mm/5. μm, He; Program: 40C(6min) => 5C/min => 80C => 10C/min => 200C |
Capillary | SPB-1 | 398. | Strete, Ruprah, et al., 1992 | 60. m/0.53 mm/5.0 μm, Helium; Program: 40 0C (6 min) 5 0C/min -> 80 0C 10 0C/min -> 200 0C |
Capillary | SPB-1 | 405. | Strete, Ruprah, et al., 1992 | 60. m/0.53 mm/5.0 μm, Helium; Program: not specified |
Capillary | OV-1 | 405. | Ramsey and Flanagan, 1982 | Program: not specified |

References

PCR Inc., 1990
PCR Inc.,
Research Chemicals Catalog 1990-1991, PCR Inc., Gainesville, FL, 1990, 1. [all data]
Stephenson and Malanowski, 1987
Stephenson, Richard M.; Malanowski, Stanislaw,
Handbook of the Thermodynamics of Organic Compounds, 1987, https://doi.org/10.1007/978-94-009-3173-2
. [all data]
Kudchadker, Kudchadker, et al., 1979
Kudchadker, A.P.; Kudchadker, S.A.; Shukla, R.P.; Patnaik, P.R.,
Vapor pressures and boiling points of selected halomethanes,
J. Phys. Chem. Ref. Data, 1979, 8, 2, 499, https://doi.org/10.1063/1.555600
. [all data]
Glew, 1960
Glew, D.N.,
THE GAS HYDRATE OF BROMOCHLORODIFLUOROMETHANE,
Can. J. Chem., 1960, 38, 2, 208-221, https://doi.org/10.1139/v60-029
. [all data]
Boublik, Fried, et al., 1984
Boublik, T.; Fried, V.; Hala, E.,
The Vapour Pressures of Pure Substances: Selected Values of the Temperature Dependence of the Vapour Pressures of Some Pure Substances in the Normal and Low Pressure Region, 2nd ed., Elsevier, New York, 1984, 972. [all data]
Wang and Leroi, 1983
Wang, F.C.-Y.; Leroi, G.E.,
Photoionization and fragmentation of halogenated methanes,
Ann. Isr. Phys. Soc., 1983, 6, 210. [all data]
Doucet, Gilbert, et al., 1975
Doucet, J.; Gilbert, R.; Sauvageau, P.; Sandorfy, C.,
Photoelectron and far-ultraviolet spectra of CF3Br, CF2BrCl, and CF2Br2,
J. Chem. Phys., 1975, 62, 366. [all data]
Flanagan, Streete, et al., 1997
Flanagan, R.J.; Streete, P.J.; Ramsey, J.D.,
Volatile Substance Abuse, UNODC Technical Series, No 5, United Nations, Office on Drugs and Crime, Vienna International Centre, PO Box 500, A-1400 Vienna, Austria, 1997, 56, retrieved from http://www.odccp.org/pdf/technicalseries1997-01-011.pdf. [all data]
Strete, Ruprah, et al., 1992
Strete, P.J.; Ruprah, M.; Ramsey, J.D.; Flanagan, R.J.,
Detection and identification of volatile substances by headspace capillary gas chromatography to aid the diagnosis of acute poisoning,
Analyst, 1992, 117, 7, 1111-1127, https://doi.org/10.1039/an9921701111
. [all data]
Ramsey and Flanagan, 1982
Ramsey, J.D.; Flanagan, R.J.,
Detection and Identification of Volatile Organic Compounds in Blood by Headspace Gas Chromatography as an Aid to the Diagnosis of Solvent Abuse,
J. Chromatogr., 1982, 240, 2, 423-444, https://doi.org/10.1016/S0021-9673(00)99622-5
. [all data]