Methane, tribromofluoro-
- Formula: CBr3F
- Molecular weight: 270.721
- IUPAC Standard InChIKey: IHZAEIHJPNTART-UHFFFAOYSA-N
- CAS Registry Number: 353-54-8
- Chemical structure:
View 3d structure (requires JavaScript / HTML 5) - Other names: Tribromofluoromethane; CFBr3; Fluorotribromomethane

Phase change data

Data compiled as indicated in comments:
BS - Robert L. Brown and Stephen E. Stein
AC - William E. Acree, Jr., James S. Chickos
Quantity | Value | Units | Method | Reference | Comment |
---|---|---|---|---|---|
Tboil | 379. to 380. | K | N/A | PCR Inc., 1990 | BS |
Enthalpy of vaporization
ΔvapH (kJ/mol) | Temperature (K) | Method | Reference | Comment |
---|---|---|---|---|
34.4 | 330. | A | Stephenson and Malanowski, 1987 | Based on data from 315. to 380. K. See also Banks, Emel«65533»us, et al., 1948.; AC |

Gas phase ion energetics data

Data compiled as indicated in comments:
LLK - Sharon G. Lias, Rhoda D. Levin, and Sherif A. Kafafi
RDSH - Henry M. Rosenstock, Keith Draxl, Bruce W. Steiner, and John T. Herron
Ionization energy determinations
IE (eV) | Method | Reference | Comment |
---|---|---|---|
10.67 ± 0.01 | PE | Chau and McDowell, 1975 | LLK |
10.67 ± 0.01 | PI | Watanabe, Nakayama, et al., 1962 | RDSH |

References

PCR Inc., 1990
PCR Inc.,
Research Chemicals Catalog 1990-1991, PCR Inc., Gainesville, FL, 1990, 1. [all data]
Stephenson and Malanowski, 1987
Stephenson, Richard M.; Malanowski, Stanislaw,
Handbook of the Thermodynamics of Organic Compounds, 1987, https://doi.org/10.1007/978-94-009-3173-2
. [all data]
Banks, Emel«65533»us, et al., 1948
Banks, A.A.; Emel«65533»us, H.J.; Haszeldine, R.N.; Kerrigan, V.,
443. The reaction of bromine trifluoride and iodine pentafluoride with carbon tetrachloride, tetrabromide, and tetraiodide and with tetraiodoethylene,
J. Chem. Soc., 1948, 2188, https://doi.org/10.1039/jr9480002188
. [all data]
Chau and McDowell, 1975
Chau, F.T.; McDowell, C.A.,
Photoelectron spectra of fluorotribromomethane and fluorotrichloromethane,
J. Electron Spectrosc. Relat. Phenom., 1975, 6, 357. [all data]
Watanabe, Nakayama, et al., 1962
Watanabe, K.; Nakayama, T.; Mottl, J.,
Ionization potentials of some molecules,
J. Quant. Spectry. Radiative Transfer, 1962, 2, 369. [all data]