Stannane, tetraisobutyl-
- Formula: C16H36Sn
- Molecular weight: 347.167
- IUPAC Standard InChIKey: CKPJWJGGZOJURQ-UHFFFAOYSA-N
- CAS Registry Number: 3531-43-9
- Chemical structure:

Condensed phase thermochemistry data

Data compiled by: José A. Martinho Simões
Quantity | Value | Units | Method | Reference | Comment |
---|---|---|---|---|---|
ΔfH°liquid | -327.8 ± 6.3 | kJ/mol | Review | Martinho Simões | |
Quantity | Value | Units | Method | Reference | Comment |
ΔcH°liquid | -11690.9 ± 5.9 | kJ/mol | CC-SB | Lautsch, Tröber, et al., 1963 | Please also see Pedley and Rylance, 1977 and Cox and Pilcher, 1970. |

Gas phase ion energetics data

Data compiled as indicated in comments:
LLK - Sharon G. Lias, Rhoda D. Levin, and Sherif A. Kafafi
Ionization energy determinations
IE (eV) | Method | Reference | Comment |
---|---|---|---|
8.68 | PE | Kochi, 1980 | Vertical value; LLK |

Phase change data

Data compiled by: William E. Acree, Jr., James S. Chickos
Enthalpy of vaporization
ΔvapH (kJ/mol) | Temperature (K) | Reference | Comment |
---|---|---|---|
53.6 ± 1.1 | 421. | Baev, 2001 | Based on data from 391. to 451. K. |

Kovats' RI, non-polar column, isothermal

Column type | Active phase | Temperature (C) | I | Reference | Comment |
---|---|---|---|---|---|
Packed | Apiezon L | 190. | 1466. | Putnam and Pu, 1965 | Celite; Column length: 1. m |

Van Den Dool and Kratz RI, non-polar column, temperature ramp

Column type | Active phase | I | Reference | Comment |
---|---|---|---|---|
Packed | Apiezon L | 1461. | Putnam and Pu, 1965, 2 | Celite, 10. K/min; Column length: 3. m; Tstart: 60. C |
Packed | Apiezon L | 1463. | Putnam and Pu, 1965, 2 | Celite, 15. K/min; Column length: 3. m; Tstart: 60. C |
Packed | Apiezon L | 1474. | Putnam and Pu, 1965, 2 | Celite, 6. K/min; Column length: 3. m; Tstart: 60. C |

References

Martinho Simões
Martinho Simões, J.A.,
Private communication (see http://webbook.nist.gov/chemistry/om/). [all data]
Lautsch, Tröber, et al., 1963
Lautsch, W.F.; Tröber, A.; Zimmer, W.; Mehner, L.; Linck, W.; Lehmann, H.M.; Brandenberger, H.; Korner, H.; Metschker, H.-J.; Wagner, K.; Kaden, R.,
Z. Chem., 1963, 3, 415. [all data]
Pedley and Rylance, 1977
Pedley, J.B.; Rylance, J.,
Computer Analysed Thermochemical Data: Organic and Organometallic Compounds, University of Sussex, Brigton, 1977. [all data]
Cox and Pilcher, 1970
Cox, J.D.; Pilcher, G.,
Thermochemistry of Organic and Organometallic Compounds
in Academic Press, New York, 1970. [all data]
Kochi, 1980
Kochi, J.K.,
The role of electron transfer and charge transfer in organometallic chemistry,
Pure Appl. Chem., 1980, 52, 571. [all data]