Cyclopropane, trans-1,2-diethynyl-
- Formula: C7H6
- Molecular weight: 90.1225
- IUPAC Standard InChIKey: WFICLMYHCKJIFK-BQBZGAKWSA-N
- CAS Registry Number: 35295-57-9
- Chemical structure:
View 3d structure (requires JavaScript / HTML 5) - Stereoisomers:

Gas phase ion energetics data

Data compiled by: Sharon G. Lias, Rhoda D. Levin, and Sherif A. Kafafi
Ionization energy determinations
IE (eV) | Method | Reference |
---|---|---|
9.00 ± 0.02 | PE | Brogli, Heilbronner, et al., 1975 |

References

Brogli, Heilbronner, et al., 1975
Brogli, F.; Heilbronner, E.; Wirz, J.; Kloster-Jensen, E.; Bergman, R.G.; Vollhardt, K.P.C.; Ashe, A.J., III,
The consequences of σ and π conjugative interactions in mono-, di- and triacetylenes. A photoelectron spectroscopic investigation,
Helv. Chim. Acta, 1975, 58, 2620. [all data]