Tellurophene,2-methyl-
- Formula: C5H6Te
- Molecular weight: 193.70
- IUPAC Standard InChIKey: FNVWHNMUBJYYEU-UHFFFAOYSA-N
- CAS Registry Number: 35246-25-4
- Chemical structure:
View 3d structure (requires JavaScript / HTML 5) - Permanent link for this species. Use this link for bookmarking this species for future reference.

Gas phase ion energetics data

Data compiled by: Sharon G. Lias, Rhoda D. Levin, and Sherif A. Kafafi
Ionization energy determinations
IE (eV) | Method | Reference | Comment |
---|---|---|---|
8.22 | CTS | Aloisi, Santini, et al., 1975 | |
8.20 ± 0.05 | PE | Fringuelli, Marino, et al., 1976 | Vertical value |

References

Aloisi, Santini, et al., 1975
Aloisi, G.; Santini, S.; Savelli, G.,
Molecular complexes of heteroaromatic five membered ring compounds with tetracyanoethylene. Charge transfer spectra, equilibrium constants and ionization potentials of the donors,
J. Chem. Soc. Faraday Trans. 1, 1975, 70, 2045. [all data]
Fringuelli, Marino, et al., 1976
Fringuelli, F.; Marino, G.; Taticchi, A.; Distefano, G.; Colonna, F.P.; Pignataro, S.,
Photoelectron spectra of the α-substituted derivatives of furan, thiophen, selenophen, and tellurophen. A comparative study of the molecular orbital energies,
J. Chem. Soc. Perkin Trans. 2, 1976, 276. [all data]