Benzene, 1-fluoro-4-methyl-
- Formula: C7H7F
- Molecular weight: 110.1289
- IUPAC Standard InChIKey: WRWPPGUCZBJXKX-UHFFFAOYSA-N
- CAS Registry Number: 352-32-9
- Chemical structure:

Gas phase thermochemistry data

Data compiled by: Hussein Y. Afeefy, Joel F. Liebman, and Stephen E. Stein
Quantity | Value | Units | Method | Reference | Comment |
---|---|---|---|---|---|
ΔfH°gas | -147.5 ± 0.08 | kJ/mol | Ccr | Good, Lacina, et al., 1962 | Corrected for CODATA value of ΔfH |

Reaction thermochemistry data

Data compiled by: John E. Bartmess
Individual Reactions
C7H6F- + =
By formula: C7H6F- + H+ = C7H7F
Quantity | Value | Units | Method | Reference | Comment |
---|---|---|---|---|---|
ΔrH° | 1588. ± 8.8 | kJ/mol | G+TS | Caldwell and Bartmess | gas phase; value altered from reference due to change in acidity scale |
Quantity | Value | Units | Method | Reference | Comment |
ΔrG° | 1558. ± 8.4 | kJ/mol | IMRE | Caldwell and Bartmess | gas phase; value altered from reference due to change in acidity scale |

Gas phase ion energetics data

Data evaluated as indicated in comments:
HL - Edward P. Hunter and Sharon G. Lias
L - Sharon G. Lias
Data compiled as indicated in comments:
B - John E. Bartmess
LLK - Sharon G. Lias, Rhoda D. Levin, and Sherif A. Kafafi
RDSH - Henry M. Rosenstock, Keith Draxl, Bruce W. Steiner, and John T. Herron
Quantity | Value | Units | Method | Reference | Comment |
---|---|---|---|---|---|
IE (evaluated) | 8.79 ± 0.01 | eV | N/A | N/A | L |
Quantity | Value | Units | Method | Reference | Comment |
Proton affinity (review) | 763.8 | kJ/mol | N/A | Hunter and Lias, 1998 | HL |
Quantity | Value | Units | Method | Reference | Comment |
Gas basicity | 736.1 | kJ/mol | N/A | Hunter and Lias, 1998 | HL |
Ionization energy determinations
IE (eV) | Method | Reference | Comment |
---|---|---|---|
8.794 ± 0.008 | EQ | Lias and Ausloos, 1978 | LLK |
8.79 ± 0.01 | PI | Watanabe, Nakayama, et al., 1962 | RDSH |
Appearance energy determinations
Ion | AE (eV) | Other Products | Method | Reference | Comment |
---|---|---|---|---|---|
C7H6F+ | 11.9 ± 0.1 | H | EI | Tait, Shannon, et al., 1962 | RDSH |
De-protonation reactions
C7H6F- + =
By formula: C7H6F- + H+ = C7H7F
Quantity | Value | Units | Method | Reference | Comment |
---|---|---|---|---|---|
ΔrH° | 1588. ± 8.8 | kJ/mol | G+TS | Caldwell and Bartmess | gas phase; value altered from reference due to change in acidity scale; B |
Quantity | Value | Units | Method | Reference | Comment |
ΔrG° | 1558. ± 8.4 | kJ/mol | IMRE | Caldwell and Bartmess | gas phase; value altered from reference due to change in acidity scale; B |

Condensed phase thermochemistry data

Data compiled as indicated in comments:
ALS - Hussein Y. Afeefy, Joel F. Liebman, and Stephen E. Stein
DH - Eugene S. Domalski and Elizabeth D. Hearing
Quantity | Value | Units | Method | Reference | Comment |
---|---|---|---|---|---|
ΔfH°liquid | -44.67 ± 0.02 | kcal/mol | Ccr | Good, Lacina, et al., 1962 | Corrected for CODATA value of ΔfH; ALS |
Quantity | Value | Units | Method | Reference | Comment |
ΔcH°liquid | -895.60 ± 0.17 | kcal/mol | Ccr | Good, Lacina, et al., 1962 | Corrected for CODATA value of ΔfH; Reanalyzed by Cox and Pilcher, 1970, Original value = -894.67 ± 0.17 kcal/mol; ALS |
ΔcH°liquid | -902.95 | kcal/mol | Ccb | Swarts, 1919 | Not corrected for CODATA value of ΔfH; ALS |
Quantity | Value | Units | Method | Reference | Comment |
S°liquid | 56.671 | cal/mol*K | N/A | Scott, Messerly, et al., 1962 | DH |
Constant pressure heat capacity of liquid
Cp,liquid (cal/mol*K) | Temperature (K) | Reference | Comment |
---|---|---|---|
41.52 | 298.15 | Meva'a and Lichanot, 1990 | T = 216 to 298 K. Cp(liq) = 164.969 + 0.350T J/mol*K (-57 to 25 C).; DH |
41.18 | 298.15 | Good, Lacina, et al., 1962 | DH |
40.911 | 298.15 | Scott, Messerly, et al., 1962 | T = 13 to 361 K.; DH |

Phase change data

Data compiled as indicated in comments:
BS - Robert L. Brown and Stephen E. Stein
TRC - Thermodynamics Research Center, NIST Boulder Laboratories, Chris Muzny director
AC - William E. Acree, Jr., James S. Chickos
ALS - Hussein Y. Afeefy, Joel F. Liebman, and Stephen E. Stein
DH - Eugene S. Domalski and Elizabeth D. Hearing
Quantity | Value | Units | Method | Reference | Comment |
---|---|---|---|---|---|
Tboil | 389. | K | N/A | PCR Inc., 1990 | BS |
Tboil | 389.8 | K | N/A | Weast and Grasselli, 1989 | BS |
Tboil | 389.8 | K | N/A | Majer and Svoboda, 1985 | |
Quantity | Value | Units | Method | Reference | Comment |
Tfus | 215.6 | K | N/A | Meva'a and Lichanot, 1990, 2 | Uncertainty assigned by TRC = 0.2 K; TRC |
Quantity | Value | Units | Method | Reference | Comment |
Ttriple | 216.48 | K | N/A | Scott, Messerly, et al., 1962, 2 | Uncertainty assigned by TRC = 0.01 K; TRC |
Quantity | Value | Units | Method | Reference | Comment |
Tc | 589.5 | K | N/A | Majer and Svoboda, 1985 | |
Quantity | Value | Units | Method | Reference | Comment |
ΔvapH° | 9.434 | kcal/mol | N/A | Majer and Svoboda, 1985 | |
ΔvapH° | 9.44 | kcal/mol | N/A | Boublik, Fried, et al., 1984 | Based on data from 340. to 430. K. See also Basarová and Svoboda, 1991.; AC |
ΔvapH° | 9.42 ± 0.02 | kcal/mol | V | Good, Lacina, et al., 1962 | Corrected for CODATA value of ΔfH; ALS |
Enthalpy of vaporization
ΔvapH (kcal/mol) | Temperature (K) | Method | Reference | Comment |
---|---|---|---|---|
8.145 | 389.8 | N/A | Majer and Svoboda, 1985 | |
8.84 | 355. | A | Stephenson and Malanowski, 1987 | Based on data from 340. to 429. K. See also Potter and Saylor, 1951 and Dykyj, Svoboda, et al., 1999.; AC |
Enthalpy of vaporization
ΔvapH =
A exp(-βTr) (1 − Tr)β
ΔvapH =
Enthalpy of vaporization (at saturation pressure)
(kcal/mol)
Tr = reduced temperature (T / Tc)
View plot Requires a JavaScript / HTML 5 canvas capable browser.
Temperature (K) | A (kcal/mol) | β | Tc (K) | Reference | Comment |
---|---|---|---|---|---|
298. to 390. | 13.11 | 0.273 | 589.5 | Majer and Svoboda, 1985 |
Antoine Equation Parameters
log10(P) = A − (B / (T + C))
P = vapor pressure (atm)
T = temperature (K)
View plot Requires a JavaScript / HTML 5 canvas capable browser.
Temperature (K) | A | B | C | Reference | Comment |
---|---|---|---|---|---|
340.83 to 428.36 | 4.11326 | 1373.934 | -55.766 | Scott, Messerly, et al., 1962 | Coefficents calculated by NIST from author's data. |
Enthalpy of fusion
ΔfusH (kcal/mol) | Temperature (K) | Method | Reference | Comment |
---|---|---|---|---|
2.103 | 215.55 | N/A | Meva'a and Lichanot, 1990 | DH |
2.235 | 216.49 | N/A | Scott, Messerly, et al., 1962 | DH |
2.23 | 216.5 | N/A | Domalski and Hearing, 1996 | AC |
1.83 | 213. | DSC | Ahmed and Eades, 1972 | AC |
Entropy of fusion
ΔfusS (cal/mol*K) | Temperature (K) | Reference | Comment |
---|---|---|---|
9.8 | 215.55 | Meva'a and Lichanot, 1990 | DH |
10.32 | 216.49 | Scott, Messerly, et al., 1962 | DH |

Normal alkane RI, non-polar column, temperature ramp

Data compiled by: NIST Mass Spectrometry Data Center, William E. Wallace, director

Column type Capillary
Active phase OV-101
Column length (m) 25.
Carrier gas N2/He
Substrate
Column diameter (mm) 0.20
Phase thickness (μm) 0.10
Tstart (C) 50.
Tend (C) 250.
Heat rate (K/min) 6.
Initial hold (min)
Final hold (min)
I 775.
ReferenceZenkevich, 2005
Comment MSDC-RI

Van Den Dool and Kratz RI, non-polar column, temperature ramp

Data compiled by: NIST Mass Spectrometry Data Center, William E. Wallace, director

Column type Capillary
Active phase Petrocol DH
Column length (m) 50.
Carrier gas He
Substrate
Column diameter (mm) 0.25
Phase thickness (μm) 0.5
Tstart (C) 35.
Tend (C) 200.
Heat rate (K/min) 3.
Initial hold (min) 10.
Final hold (min) 10.
I 770.4
ReferenceCensullo, Jones, et al., 2003
Comment MSDC-RI

References

Good, Lacina, et al., 1962
Good, W.D.; Lacina, J.L.; Scott, D.W.; McCullough, J.P.,
Combustion calorimetry of organic fluorine compounds. The heats of combustion and formation of the difluorobenzenes, 4-fluorotoluene and m-trifluorotoluic acid,
J. Phys. Chem., 1962, 66, 1529-1532. [all data]
Caldwell and Bartmess
Caldwell, G.; Bartmess, J.E.,
, Unpublished results. [all data]
Hunter and Lias, 1998
Hunter, E.P.; Lias, S.G.,
Evaluated Gas Phase Basicities and Proton Affinities of Molecules: An Update,
J. Phys. Chem. Ref. Data, 1998, 27, 3, 413-656, https://doi.org/10.1063/1.556018
. [all data]
Lias and Ausloos, 1978
Lias, S.G.; Ausloos, P.J.,
eIonization energies of organic compounds by equilibrium measurements,
J. Am. Chem. Soc., 1978, 100, 6027. [all data]
Watanabe, Nakayama, et al., 1962
Watanabe, K.; Nakayama, T.; Mottl, J.,
Ionization potentials of some molecules,
J. Quant. Spectry. Radiative Transfer, 1962, 2, 369. [all data]
Tait, Shannon, et al., 1962
Tait, J.M.S.; Shannon, T.W.; Harrison, A.G.,
The structure of substituted C7 ions from benzyl derivatives at the appearance potential threshold,
J. Am. Chem. Soc., 1962, 84, 4. [all data]