7-Tetradecyne
- Formula: C14H26
- Molecular weight: 194.3562
- IUPAC Standard InChIKey: AFNWSIIBAYUTTL-UHFFFAOYSA-N
- CAS Registry Number: 35216-11-6
- Chemical structure:
View 3d structure (requires JavaScript / HTML 5) - Other names: 7-C14H26; 7-Tetadecyne

Phase change data

Data compiled by: Robert L. Brown and Stephen E. Stein
Reduced pressure boiling point
Tboil (K) | Pressure (bar) | Reference |
---|---|---|
397. | 0.020 | Farchan Laboratories, 1990 |

Gas phase ion energetics data

Data compiled as indicated in comments:
LLK - Sharon G. Lias, Rhoda D. Levin, and Sherif A. Kafafi
Ionization energy determinations
IE (eV) | Method | Reference | Comment |
---|---|---|---|
9.03 ± 0.04 | PI | Rang and Martinson, 1978 | LLK |
9.067 ± 0.005 | PE | Carlier, Dubois, et al., 1975 | LLK |

Kovats' RI, non-polar column, isothermal

Column type | Active phase | Temperature (C) | I | Reference | Comment |
---|---|---|---|---|---|
Capillary | OV-101 | 110. | 1416. | Kuningas, Rang, et al., 1990 | He; Column length: 50. m; Column diameter: 0.25 mm |
Capillary | Apiezon L | 150. | 1400. | Rang, Kuningas, et al., 1976 | N2; Column length: 50. m; Column diameter: 0.25 mm |
Capillary | Apiezon L | 170. | 1400. | Rang, Kuningas, et al., 1976 | N2; Column length: 50. m; Column diameter: 0.25 mm |
Capillary | Apiezon L | 190. | 1401. | Rang, Kuningas, et al., 1976 | N2; Column length: 50. m; Column diameter: 0.25 mm |

Kovats' RI, polar column, isothermal

Column type | Active phase | Temperature (C) | I | Reference | Comment |
---|---|---|---|---|---|
Capillary | PEG-20M | 80. | 1545.1 | Orav, Kuningas, et al., 1993 | 100. m/0.25 mm/0.12 μm |
Capillary | PEG-20M | 80. | 1562.3 | Orav, Kuningas, et al., 1993 | 100. m/0.25 mm/0.24 μm |
Capillary | PEG-20M | 80. | 1563. | Orav, Kuningas, et al., 1993 | 60. m/0.32 mm/0.25 μm |
Capillary | PEG 4000 | 110. | 1572. | Rang, Orav, et al., 1988 | |
Capillary | PEG 4000 | 120. | 1572. | Rang, Orav, et al., 1988 | |
Capillary | PEG 4000 | 140. | 1574. | Rang, Orav, et al., 1988 | |
Capillary | PEG 4000 | 150. | 1574. | Rang, Orav, et al., 1988 | |
Capillary | PEG 4000 | 160. | 1575. | Rang, Orav, et al., 1988 | |
Capillary | PEG-20M | 70. | 1541.3 | Orav, Kuningas, et al., 1985 | Column length: 100. m; Column diameter: 0.25 mm |
Capillary | PEG-20M | 80. | 1545.1 | Orav, Kuningas, et al., 1985 | Column length: 100. m; Column diameter: 0.25 mm |
Capillary | PEG-20M | 80. | 1562.3 | Orav, Kuningas, et al., 1985 | Column length: 100. m; Column diameter: 0.25 mm |

References

Farchan Laboratories, 1990
Farchan Laboratories,
Research Chemicals Catalog, Farchan Laboratories, Gainesville, FL, 1990, 91. [all data]
Rang and Martinson, 1978
Rang, S.; Martinson, E.,
Ionization potentials of unsaturated hydrocarbons. 3. n-Alkyunes C8-C12.,
Eesti. NSV Tead. Akad. Toim. Keem., 1978, 44. [all data]
Carlier, Dubois, et al., 1975
Carlier, P.; Dubois, J.E.; Masclet, P.; Mouvier, G.,
Spectres de photoelectrons des alcynes,
J. Electron Spectrosc. Relat. Phenom., 1975, 7, 55. [all data]
Kuningas, Rang, et al., 1990
Kuningas, K.; Rang, S.; Kailas, T.,
Relationship between the structure and retention of n-alkenes and n-alkynes on silicone phases,
J. Chromatogr., 1990, 520, 137-148, https://doi.org/10.1016/0021-9673(90)85094-C
. [all data]
Rang, Kuningas, et al., 1976
Rang, S.; Kuningas, K.; Orav, A.; Eisen, O.,
Capillary gas chromatography of n-alkynes. I. Retention indices,
J. Chromatogr., 1976, 119, 451-460, https://doi.org/10.1016/S0021-9673(00)86807-7
. [all data]
Orav, Kuningas, et al., 1993
Orav, A.; Kuningas, K.; Rang, S.,
A comparison of different retention index systems with unsaturated and aromatic hydrocarbons in capillary gas chromatography on PEG 20MK,
Chromatographia, 1993, 37, 7/8, 411-414, https://doi.org/10.1007/BF02272257
. [all data]
Rang, Orav, et al., 1988
Rang, S.A.; Orav, A.E.; Kuningas, K.R.; Meister, A.E.; Strense, T.V.; Eisen, O.G.,
Gas-Chromatographic Characteristics of unsaturated hydrocarbons, Academy of Sciences of Estonia SSR, Tallinn, Estonia SSR, 1988, 208. [all data]
Orav, Kuningas, et al., 1985
Orav, A.; Kuningas, K.; Rang, S.; Eisen, O.,
Capillary gas chromatography of n-tridecenes, n-tetradecenes and C10-C14 n-alkynes on polyethylene glycol 20m of different polarity,
Eesti NSV Tead. Akad. Toim. Keem., 1985, 34, 2, 105-113. [all data]