Acetanilide, 4'-fluoro-
- Formula: C8H8FNO
- Molecular weight: 153.1536
- IUPAC Standard InChIKey: JHEFOJNPLXSWNZ-UHFFFAOYSA-N
- CAS Registry Number: 351-83-7
- Chemical structure:
View 3d structure (requires JavaScript / HTML 5) - Other names: 4'-Fluoroacetanilide; 4-Fluoroacetanilide; p-Fluoroacetanilide; Acetamide, N-(4-fluorophenyl)-; N-(4-fluorophenyl)acetamide

Condensed phase thermochemistry data

Data compiled by: Hussein Y. Afeefy, Joel F. Liebman, and Stephen E. Stein
Quantity | Value | Units | Method | Reference | Comment |
---|---|---|---|---|---|
ΔcH°solid | -4094. | kJ/mol | Ccb | Swarts, 1919 | Not corrected for CODATA value of ΔfH |

Gas phase ion energetics data

Data compiled by: Sharon G. Lias, Rhoda D. Levin, and Sherif A. Kafafi
Ionization energy determinations
IE (eV) | Method | Reference |
---|---|---|
8.20 ± 0.03 | EI | Benezra and Bursey, 1971 |
Appearance energy determinations
Ion | AE (eV) | Other Products | Method | Reference | Comment |
---|---|---|---|---|---|
C2H3O+ | 13.42 ± 0.03 | ? | EI | Benezra and Bursey, 1971 | |
C6H6NF+ | 10.12 ± 0.03 | CH2=C=O | EI | Benezra and Bursey, 1971 |

References

Swarts, 1919
Swarts, F.,
Etudes thermochimiques sur les combinaisons organiques fluorees,
J. Chim. Phys., 1919, 17, 3-70. [all data]
Benezra and Bursey, 1971
Benezra, S.A.; Bursey, M.M.,
ortho-Effects on ordering factors in mass spectral rearrangements. Loss of keten from halogenated phenyl acetates and acetanilides,
J. Chem. Soc. B, 1971, 1515. [all data]