Phenol, 3-bromo-, acetate
- Formula: C8H7BrO2
- Molecular weight: 215.044
- IUPAC Standard InChIKey: CDLTWXBTYNNYLN-UHFFFAOYSA-N
- CAS Registry Number: 35065-86-2
- Chemical structure:
View 3d structure (requires JavaScript / HTML 5) - Other names: Phenol, 3-bromo-, 1-acetate; 1-acetoxy-3-bromobenzene

Gas phase ion energetics data

Data compiled by: Sharon G. Lias, Rhoda D. Levin, and Sherif A. Kafafi
Ionization energy determinations
IE (eV) | Method | Reference |
---|---|---|
8.8 ± 0.2 | EI | Gamble, Gilbert, et al., 1971 |
Appearance energy determinations
Ion | AE (eV) | Other Products | Method | Reference | Comment |
---|---|---|---|---|---|
C2H3O+ | 12.4 ± 0.2 | ? | EI | Gamble, Gilbert, et al., 1971 | |
C6H5OBr+ | 10.0 ± 0.2 | CH2=C=O | EI | Gamble, Gilbert, et al., 1971 |

References

Gamble, Gilbert, et al., 1971
Gamble, A.A.; Gilbert, J.R.; Tillett, J.G.,
Substituent effects on the mass spectra of substituted phenyl acetates,
Org. Mass Spectrom., 1971, 5, 1093. [all data]