Phosphonothioic dichloride, phenyl-
- Formula: C6H5Cl2PS
- Molecular weight: 211.049
- IUPAC Standard InChIKey: SXIWNIQDOJKDGB-UHFFFAOYSA-N
- CAS Registry Number: 3497-00-5
- Chemical structure:
View 3d structure (requires JavaScript / HTML 5) - Other names: Dichlorophenylphosphine sulfide; Phenylphosphonothioic dichloride; Phenylphosphonothionodichloridate; Phenylphosphonothioyl dichloride; Phenylthionophosphonic dichloride; Phenylthiophosphonyl dichloride; Phosphine sulfide, dichlorophenyl-; Benzenephosphorus thiodichloride; Phenyl phosphorus thiodichloride; UN 2799; Phosphonodichloridothioic acid, phenyl-; NSC 62217; Phosphonothioic dichloride, P-phenyl-; dichloro(phenyl)phosphine sulphide

Gas phase ion energetics data

Data compiled by: Sharon G. Lias, Rhoda D. Levin, and Sherif A. Kafafi
Ionization energy determinations
IE (eV) | Method | Reference | Comment |
---|---|---|---|
9.02 | PE | Vovna, Lopatin, et al., 1974 | |
9.02 ± 0.03 | PE | Vilesov, Lopatin, et al., 1974 | |
9.47 | PE | Zverev, Vilesov, et al., 1975 | Vertical value |

References

Vovna, Lopatin, et al., 1974
Vovna, V.I.; Lopatin, S.N.; Pettsold, R.; Vilesov, F.I.; Akopyan, M.E.,
Photoelectron spectra of a number of substitution products of thiophosphoryl chloride,
Opt. Spectrosc., 1974, 36, 99. [all data]
Vilesov, Lopatin, et al., 1974
Vilesov, F.I.; Lopatin, S.N.; Vovna, V.I.; Paetzold, R.; Niendorf, K.,
Untersuchungen an molekulkomplexen. 3. Mitteilung: Zusammenhang zwischen der ionisierungsenergie von R1R2R3PS-molekulen und der stabilitat ihrer molekulkomplexe mit jod,
Z. Phys. Chem. (Leipzig), 1974, 255, 661. [all data]
Zverev, Vilesov, et al., 1975
Zverev, V.V.; Vilesov, F.I.; Vovna, V.I.; Lopatin, S.N.; Kitaev, Y.P.,
Photoelectron spectra,
Izv. Akad. Nauk SSSR, Ser. Khim., 1975, 1975, 1051. [all data]