Butane, 2-methyl-2-nitroso-
- Formula: C5H11NO
- Molecular weight: 101.1469
- IUPAC Standard InChIKey: CCRGYMRZYGPFRS-UHFFFAOYSA-N
- CAS Registry Number: 34946-78-6
- Chemical structure:
View 3d structure (requires JavaScript / HTML 5) - Permanent link for this species. Use this link for bookmarking this species for future reference.

Gas phase ion energetics data

Data compiled by: Sharon G. Lias, Rhoda D. Levin, and Sherif A. Kafafi
Appearance energy determinations
Ion | AE (eV) | Other Products | Method | Reference | Comment |
---|---|---|---|---|---|
C5H11+ | 8.7 ± 0.1 | ? | EI | Carmichael, Gowenlock, et al., 1972 |

References

Carmichael, Gowenlock, et al., 1972
Carmichael, P.J.; Gowenlock, B.G.; Johnson, C.A.F.,
Carbon-nitrogen bond dissociation energy values in C-nitrosocompounds,
Int. J. Chem. Kinet., 1972, 4, 339. [all data]