4-Methoxybenzylradical
- Formula: C8H9O
- Molecular weight: 121.1565
- IUPAC Standard InChIKey: WADJDQQIPSKENN-UHFFFAOYSA-N
- CAS Registry Number: 3494-45-9
- Chemical structure:
View 3d structure (requires JavaScript / HTML 5) - Permanent link for this species. Use this link for bookmarking this species for future reference.

Gas phase ion energetics data

Data compiled by: Henry M. Rosenstock, Keith Draxl, Bruce W. Steiner, and John T. Herron
Ionization energy determinations
IE (eV) | Method | Reference |
---|---|---|
6.8 ± 0.1 | EI | Harrison, Kebarle, et al., 1961 |

References

Harrison, Kebarle, et al., 1961
Harrison, A.G.; Kebarle, P.; Lossing, F.P.,
Free radicals by mass spectrometry. XXI. The ionization potentials of some meta and para substituted benzyl radicals,
J. Am. Chem. Soc., 1961, 83, 777. [all data]