Aniline, p,p'-(p-phenylenedioxy)di-
- Formula: C18H16N2O2
- Molecular weight: 292.3318
- IUPAC Standard InChIKey: JCRRFJIVUPSNTA-UHFFFAOYSA-N
- CAS Registry Number: 3491-12-1
- Chemical structure:
View 3d structure (requires JavaScript / HTML 5) - Other names: 1,4-Phenylene-di-4-aminophenyl ether; Benzenamine,4,4'-[1,4-phenylenebis(oxy)]bis-

Reaction thermochemistry data

Data compiled by: Hussein Y. Afeefy, Joel F. Liebman, and Stephen E. Stein
Individual Reactions
+
= C26H20N2O5
By formula: C18H16N2O2 + C8H4O3 = C26H20N2O5
Quantity | Value | Units | Method | Reference | Comment |
---|---|---|---|---|---|
ΔrH° | -68.2 ± 0.4 | kJ/mol | Eqk | Karyakin, Rabinovich, et al., 1978 | liquid phase; solvent: DMF |

Gas phase ion energetics data

Data compiled by: Sharon G. Lias, Rhoda D. Levin, and Sherif A. Kafafi
Ionization energy determinations
IE (eV) | Method | Reference |
---|---|---|
6.60 | PI | Pykhtina, Cherednichenko, et al., 1974 |

References

Karyakin, Rabinovich, et al., 1978
Karyakin, N.V.; Rabinovich, I.B.; Pal'tseva, N.G.,
Thermodynamics of the reactions of aromatic diamines with dianhydrides of tetracarboxylic acids,
Polym. Sci. USSR, 1978, 20, 2274-2279. [all data]
Pykhtina, Cherednichenko, et al., 1974
Pykhtina, E.V.; Cherednichenko, L.V.; Kardash, I.E.; Evlasheva, T.I.; Sorokin, V.V.; Potapov, V.K.; Pravednikov, A.N.,
Ionization potentials of amines and energies of charge transfer bands in the absorption spectra of complexes of 7,7,8,8-tetracyanoquinodimethan,
High Energy Chem., 1974, 8, 257, In original 307. [all data]