Methyl, dibromochloro-
- Formula: CBr2Cl
- Molecular weight: 207.272
- IUPAC Standard InChIKey: LPDLBPXYMCOBCU-UHFFFAOYSA-N
- CAS Registry Number: 34902-22-2
- Chemical structure:
View 3d structure (requires JavaScript / HTML 5) - Permanent link for this species. Use this link for bookmarking this species for future reference.

Vibrational and/or electronic energy levels

Data compiled by: Marilyn E. Jacox
State: X
Vib. sym. |
No. | Approximate type of mode |
cm-1 | Med. | Method | References | |
---|---|---|---|---|---|---|---|
CCl stretch | 856 | vs | Ar | IR | Andrews, 1968 Maltsev, Nefedov, et al., 1971 | ||
CBr stretch | 783 | vs | Ar | IR | Andrews, 1968 Maltsev, Nefedov, et al., 1971 | ||
Additional references: Jacox, 1994, page 218

Gas phase ion energetics data

Data compiled by: Sharon G. Lias and Joel F. Liebman
Ionization energy determinations
IE (eV) | Method | Reference |
---|---|---|
14. ± 1. | DER | Langford and Harris, 1990 |

References

Andrews, 1968
Andrews, L.,
Infrared Spectrum of the Trichloromethyl Radical in Solid Argon,
J. Chem. Phys., 1968, 48, 3, 972, https://doi.org/10.1063/1.1668852
. [all data]
Maltsev, Nefedov, et al., 1971
Maltsev, A.K.; Nefedov, O.M.; Hauge, R.H.; Margrave, J.L.; Seyferth, D.,
Matrix-isolation study of the pyrolysis of bromochloromethyl-substituted organomercury compounds. Infrared spectra of the bromochlorocarbene andree radicals CCl2Br and CClBr2,
J. Phys. Chem., 1971, 75, 26, 3984, https://doi.org/10.1021/j100695a013
. [all data]
Jacox, 1994
Jacox, M.E.,
Vibrational and electronic energy levels of polyatomic transient molecules, American Chemical Society, Washington, DC, 1994, 464. [all data]