Dibenzo[fg,mn]naphtho[1,2,3,4-xyz]heptaphene
- Formula: C42H22
- Molecular weight: 526.6241
- IUPAC Standard InChIKey: VQTIXOWFVHAUMZ-UHFFFAOYSA-N
- CAS Registry Number: 34814-82-9
- Chemical structure:

Gas phase ion energetics data

Data compiled as indicated in comments:
LLK - Sharon G. Lias, Rhoda D. Levin, and Sherif A. Kafafi
Ionization energy determinations
IE (eV) | Method | Reference | Comment |
---|---|---|---|
6.18 ± 0.02 | PE | Clar and Schmidt, 1978 | LLK |

References

Clar and Schmidt, 1978
Clar, E.; Schmidt, W.,
Correlations between photoelectron and ultravioet absorption spectra of polycyclic hydrocarbons. The terrylene and peropyrene series,
Tetrahedron, 1978, 34, 3219. [all data]