η5-Pentamethylcyclopentadienyl manganese tricarbonyl
- Formula: C13H15MnO3
- Molecular weight: 274.1944
- IUPAC Standard InChIKey: KPSUISFNSGZUIK-UHFFFAOYSA-N
- CAS Registry Number: 34807-89-1
- Chemical structure:
View 3d structure (requires JavaScript / HTML 5) - Other names: Manganese, tricarbonyl[(1,2,3,4,5-η)-1,2,3,4,5-pentamethyl-2,4-cyclopentadien-1-yl]-; Hapto5-pentamethylcyclopentadienylmanganese tricarbonyl

Gas phase ion energetics data

Data compiled as indicated in comments:
LLK - Sharon G. Lias, Rhoda D. Levin, and Sherif A. Kafafi
Ionization energy determinations
IE (eV) | Method | Reference | Comment |
---|---|---|---|
7.0 | PE | Calabro, Hubbard, et al., 1981 | LLK |
7.46 | PE | Calabro, Hubbard, et al., 1981 | Vertical value; LLK |

References

Calabro, Hubbard, et al., 1981
Calabro, D.C.; Hubbard, J.L.; Blevins, C.H., II; Campbell, A.C.; Lichtenberger, D.L.,
The effects of methyl group substitution on metal-coordinated cyclopentadienyl rings. The core and valence ionizations of methylated tricarbonyl(η5-cyclopentadienyl)metal complexes,
J. Am. Chem. Soc., 1981, 103, 6839. [all data]