2-Aminoacetanilide
- Formula: C8H10N2O
- Molecular weight: 150.1778
- IUPAC Standard InChIKey: MPXAYYWSDIKNTP-UHFFFAOYSA-N
- CAS Registry Number: 34801-09-7
- Chemical structure:
View 3d structure (requires JavaScript / HTML 5) - Other names: Acetamide, N-(2-aminophenyl)-

Gas phase ion energetics data

Data compiled by: Sharon G. Lias, Rhoda D. Levin, and Sherif A. Kafafi
Ionization energy determinations
IE (eV) | Method | Reference |
---|---|---|
7.39 ± 0.02 | EI | Benezra and Bursey, 1972 |
Appearance energy determinations
Ion | AE (eV) | Other Products | Method | Reference | Comment |
---|---|---|---|---|---|
C6H7N2+ | 13.93 ± 0.02 | CH3CO | EI | Benezra and Bursey, 1972 | |
C6H8N2+ | 10.49 ± 0.02 | CH2=C=O | EI | Benezra and Bursey, 1972 |

References

Benezra and Bursey, 1972
Benezra, S.A.; Bursey, M.M.,
Hydrogen bonding in mass spectral activated complexes. A correction,
J. Chem. Soc. Perkin Trans. 2, 1972, 11, 1537. [all data]