tert-Butyl m-Tolyl sulfide
- Formula: C11H16S
- Molecular weight: 180.310
- IUPAC Standard InChIKey: NOSDQZYLLGTSNW-UHFFFAOYSA-N
- CAS Registry Number: 34786-26-0
- Chemical structure:
View 3d structure (requires JavaScript / HTML 5) - Other names: Benzene, 1-[(1,1-dimethylethyl)thio]-3-methyl-

Gas phase ion energetics data

Data compiled as indicated in comments:
LLK - Sharon G. Lias, Rhoda D. Levin, and Sherif A. Kafafi
Ionization energy determinations
IE (eV) | Method | Reference | Comment |
---|---|---|---|
8.35 | PE | Dewar, Ernstbrunner, et al., 1974 | Vertical value; LLK |

References

Dewar, Ernstbrunner, et al., 1974
Dewar, P.S.; Ernstbrunner, E.; Gilmore, J.R.; Godfrey, M.; Mellor, J.M.,
Conformational analysis of alkyl aryl ethers and alkyl aryl sulphides by photoelectron spectroscopy,
Tetrahedron, 1974, 30, 2455. [all data]