Chromium,pentacarbonyl(2-furanylmethoxymethylene)-(oc-6-21)-
- Formula: C11H6CrO7
- Molecular weight: 302.1572
- CAS Registry Number: 34741-93-0

Gas phase ion energetics data

Data compiled by: Sharon G. Lias, Rhoda D. Levin, and Sherif A. Kafafi
Ionization energy determinations
IE (eV) | Method | Reference | Comment |
---|---|---|---|
7.37 | PE | Block and Fenske, 1977 | Vertical value |

References

Block and Fenske, 1977
Block, T.F.; Fenske, R.F.,
A photoelectron spectroscopic study of some pentacarbonylchromium carbene complexes,
J. Am. Chem. Soc., 1977, 99, 4321. [all data]