1,1-Difluoro-1-silacyclo-3-pentene
- Formula: C4H6F2Si
- Molecular weight: 120.1727
- IUPAC Standard InChIKey: CDSNIUJIENGNBO-UHFFFAOYSA-N
- CAS Registry Number: 34736-33-9
- Chemical structure:
View 3d structure (requires JavaScript / HTML 5) - Other names: Silacyclopent-3-ene, 1,1-difluoro-; Silacyclopen-3-ene, 1,1-difluoro-

Gas phase ion energetics data

Data compiled by: Sharon G. Lias, Rhoda D. Levin, and Sherif A. Kafafi
Ionization energy determinations
IE (eV) | Method | Reference | Comment |
---|---|---|---|
9.62 | PE | Bertoti, Cradock, et al., 1976 | Vertical value |

References

Bertoti, Cradock, et al., 1976
Bertoti, I.; Cradock, S.; Ebsworth, E.A.V.; Whiteford, R.A.,
Photoelectron spectra and transannular interactions in 1-silacyclopent-3-enes,
J. Chem. Soc. Dalton Trans., 1976, 937. [all data]