5-Phenyl-1,2,3,4-thiatriazole
- Formula: C7H5N3S
- Molecular weight: 163.200
- IUPAC Standard InChIKey: PXZQTGLTLYTSHC-UHFFFAOYSA-N
- CAS Registry Number: 34733-85-2
- Chemical structure:
View 3d structure (requires JavaScript / HTML 5) - Other names: Phenyl-1,2,3,4-thiatriazol

Gas phase ion energetics data

Data compiled by: Sharon G. Lias and Joel F. Liebman
Ionization energy determinations
IE (eV) | Method | Reference |
---|---|---|
9.1 | PE | Bender, Carnovale, et al., 1988 |

References

Bender, Carnovale, et al., 1988
Bender, H.; Carnovale, F.; Peel, J.B.; Wentrup, C.,
Dinitrogen sulfide, N2S, revealed by photoelectron spectroscopy,
J. Am. Chem. Soc., 1988, 110, 3458. [all data]