Tellurophene, tetrahydro-
- Formula: C4H8Te
- Molecular weight: 183.71
- IUPAC Standard InChIKey: XDCYTDZPMNTANZ-UHFFFAOYSA-N
- CAS Registry Number: 3465-99-4
- Chemical structure:
View 3d structure (requires JavaScript / HTML 5) - Other names: Cyclotellurobutane; Tellurophane; Tetrahydrotellurophene

Gas phase ion energetics data

Data compiled by: Sharon G. Lias, Rhoda D. Levin, and Sherif A. Kafafi
Ionization energy determinations
IE (eV) | Method | Reference | Comment |
---|---|---|---|
7.73 | PE | Pignataro and Distefano, 1974 | Vertical value |

References

Pignataro and Distefano, 1974
Pignataro, S.; Distefano, G.,
n-σ mixing in pentatomic heterocyclic compounds of sixth group by photoelectron spectroscopy,
Chem. Phys. Lett., 1974, 26, 356. [all data]