Benzenepropanoic acid, β-methyl-, methyl ester
- Formula: C11H14O2
- Molecular weight: 178.2277
- IUPAC Standard InChIKey: DSWKGCIHFICHAC-UHFFFAOYSA-N
- CAS Registry Number: 3461-39-0
- Chemical structure:
View 3d structure (requires JavaScript / HTML 5) - Other names: Hydrocinnamic acid, β-methyl-, methyl ester; Methyl 3-phenylbutanoate; Methyl 3-phenylbutyrate; Methyl ester of β-Methylbenzenepropanoic acid; 3-Phenylbutanoic acid methyl ester

Gas phase ion energetics data

Data compiled by: Henry M. Rosenstock, Keith Draxl, Bruce W. Steiner, and John T. Herron
Ionization energy determinations
IE (eV) | Method | Reference |
---|---|---|
8.7 ± 0.2 | EI | Howe, Williams, et al., 1969 |
Appearance energy determinations
Ion | AE (eV) | Other Products | Method | Reference | Comment |
---|---|---|---|---|---|
C8H9+ | 11.4 ± 0.2 | ? | EI | Howe, Williams, et al., 1969 | |
C9H10+ | 9.7 ± 0.2 | ? | EI | Howe, Williams, et al., 1969 | |
C10H11O+ | 11.0 ± 0.2 | CH3O | EI | Howe, Williams, et al., 1969 |

References

Howe, Williams, et al., 1969
Howe, I.; Williams, D.H.; Kingston, D.G.I.; Tannenbaum, H.P.,
Substituent effects in the mass spectra of some - and -substituted methyl butyrates,
J. Chem. Soc. B, 1969, 439. [all data]