2,2-Dimethoxybutane
- Formula: C6H14O2
- Molecular weight: 118.1742
- IUPAC Standard InChIKey: OXQHJIGWZNIQDS-UHFFFAOYSA-N
- CAS Registry Number: 3453-99-4
- Chemical structure:
View 3d structure (requires JavaScript / HTML 5) - Other names: Butane, 2,2-dimethoxy

Phase change data

Data compiled by: William E. Acree, Jr., James S. Chickos
Enthalpy of fusion
ΔfusH (kJ/mol) | Temperature (K) | Reference |
---|---|---|
9.32 | 174. | Teodorescu, Wilken, et al., 2003 |

Reaction thermochemistry data

Data compiled by: Hussein Y. Afeefy, Joel F. Liebman, and Stephen E. Stein
Individual Reactions
By formula: C6H14O2 + H2O = 2CH4O + C4H8O
Quantity | Value | Units | Method | Reference | Comment |
---|---|---|---|---|---|
ΔrH° | 19.33 ± 0.04 | kJ/mol | Cm | Wiberg and Squires, 1979 | liquid phase; Heat of hydrolysis |

Normal alkane RI, non-polar column, temperature ramp

Column type | Active phase | I | Reference | Comment |
---|---|---|---|---|
Capillary | OV-101 | 740. | Zenkevich, 2005 | 25. m/0.20 mm/0.10 μm, N2/He, 6. K/min; Tstart: 50. C; Tend: 250. C |

References

Teodorescu, Wilken, et al., 2003
Teodorescu, Mariana; Wilken, Michael; Wittig, Roland; Gmehling, Jürgen,
Azeotropic and solid--liquid equilibria data for several binary organic systems containing one acetal compound,
Fluid Phase Equilibria, 2003, 204, 2, 267-280, https://doi.org/10.1016/S0378-3812(02)00260-1
. [all data]
Wiberg and Squires, 1979
Wiberg, K.B.; Squires, R.R.,
Thermodynamics of hydrolysis aliphatic ketals. An entropy component of steric effects,
J. Am. Chem. Soc., 1979, 101, 5512-5515. [all data]
Zenkevich, 2005
Zenkevich, I.G.,
Experimentally measured retention indices., 2005. [all data]