3,4-Octadiene
- Formula: C8H14
- Molecular weight: 110.1968
- IUPAC Standard InChIKey: YOXGDVVRKJDLCI-UHFFFAOYSA-N
- CAS Registry Number: 34511-01-8
- Chemical structure:
View 3d structure (requires JavaScript / HTML 5) - Permanent link for this species. Use this link for bookmarking this species for future reference.

Gas phase ion energetics data

Data compiled by: Henry M. Rosenstock, Keith Draxl, Bruce W. Steiner, and John T. Herron
Appearance energy determinations
Ion | AE (eV) | Other Products | Method | Reference | Comment |
---|---|---|---|---|---|
C5H7+ | 11.6 | ? | EI | Polyakova, Zimina, et al., 1960 |

References

Polyakova, Zimina, et al., 1960
Polyakova, A.A.; Zimina, K.I.; Petrov, A.A.; Khmel'nitskii, R.A.,
Mass spectra and structure of some allenes,
Zh. Obshch. Khim., 1960, 30, 2977, In original 2949. [all data]