Benzene,1-methyl-3-(2-phenylethyl)-
- Formula: C15H16
- Molecular weight: 196.2875
- IUPAC Standard InChIKey: ZWRSMFOUGMXCNP-UHFFFAOYSA-N
- CAS Registry Number: 34403-06-0
- Chemical structure:
View 3d structure (requires JavaScript / HTML 5) - Permanent link for this species. Use this link for bookmarking this species for future reference.

Gas phase ion energetics data

Data evaluated as indicated in comments:
HL - Edward P. Hunter and Sharon G. Lias
Data compiled as indicated in comments:
LLK - Sharon G. Lias, Rhoda D. Levin, and Sherif A. Kafafi
Quantity | Value | Units | Method | Reference | Comment |
---|---|---|---|---|---|
Proton affinity (review) | 833.5 | kJ/mol | N/A | Hunter and Lias, 1998 | HL |
Quantity | Value | Units | Method | Reference | Comment |
Gas basicity | 801.0 | kJ/mol | N/A | Hunter and Lias, 1998 | HL |
Ionization energy determinations
IE (eV) | Method | Reference | Comment |
---|---|---|---|
8.59 ± 0.05 | EI | Kuck and Grutzmacher, 1979 | LLK |
Appearance energy determinations
Ion | AE (eV) | Other Products | Method | Reference | Comment |
---|---|---|---|---|---|
C7H7+ | 11.1 ± 0.2 | ? | EI | Kuck and Grutzmacher, 1979 | LLK |
C8H8+ | 10.1 ± 0.2 | ? | EI | Kuck and Grutzmacher, 1979 | LLK |
C8H9+ | 10.4 ± 0.1 | ? | EI | Kuck and Grutzmacher, 1979 | LLK |

References

Hunter and Lias, 1998
Hunter, E.P.; Lias, S.G.,
Evaluated Gas Phase Basicities and Proton Affinities of Molecules: An Update,
J. Phys. Chem. Ref. Data, 1998, 27, 3, 413-656, https://doi.org/10.1063/1.556018
. [all data]
Kuck and Grutzmacher, 1979
Kuck, D.; Grutzmacher, H.-Fr.,
The activation energy of the skeletal isomerization in the radical cations of toluene and cycloheptatriene by mass spectrometry of their 2-phenylethyl derivatives,
Org. Mass Spectrom., 1979, 14, 86. [all data]