3-Amino-4-picoline
- Formula: C6H8N2
- Molecular weight: 108.1411
- IUPAC Standard InChIKey: IBKMZYWDWWIWEL-UHFFFAOYSA-N
- CAS Registry Number: 3430-27-1
- Chemical structure:
View 3d structure (requires JavaScript / HTML 5) - Other names: 3-Pyridinamine, 4-methyl-; 4-Picoline, 3-amino-

Phase change data

Data compiled by: Robert L. Brown and Stephen E. Stein
Reduced pressure boiling point
Tboil (K) | Pressure (bar) | Reference |
---|---|---|
527.2 | 0.980 | Weast and Grasselli, 1989 |

Gas phase ion energetics data

Data compiled by: Sharon G. Lias, Rhoda D. Levin, and Sherif A. Kafafi
Ionization energy determinations
IE (eV) | Method | Reference |
---|---|---|
9.3 | CTS | Daisey and Sonnessa, 1972 |

References

Weast and Grasselli, 1989
CRC Handbook of Data on Organic Compounds, 2nd Editon, Weast,R.C and Grasselli, J.G., ed(s)., CRC Press, Inc., Boca Raton, FL, 1989, 1. [all data]
Daisey and Sonnessa, 1972
Daisey, J.M.; Sonnessa, A.J.,
A study of the thermodynamic and spectral properties of molecular complexes of iodine with several aminopyridines,
J. Phys. Chem., 1972, 76, 1895. [all data]