Methanone,phenylpyrazinyl-
- Formula: C11H8N2O
- Molecular weight: 184.1940
- IUPAC Standard InChIKey: LFMSOZLXKHFQBF-UHFFFAOYSA-N
- CAS Registry Number: 3430-09-9
- Chemical structure:
View 3d structure (requires JavaScript / HTML 5) - Permanent link for this species. Use this link for bookmarking this species for future reference.

Gas phase ion energetics data

Data compiled by: Sharon G. Lias, Rhoda D. Levin, and Sherif A. Kafafi
Ionization energy determinations
IE (eV) | Method | Reference |
---|---|---|
9.4 ± 0.1 | EI | Grutzmacher and Schubert, 1979 |
Appearance energy determinations
Ion | AE (eV) | Other Products | Method | Reference | Comment |
---|---|---|---|---|---|
C7H5O+ | 10.8 ± 0.1 | C4H3N2 | EI | Grutzmacher and Schubert, 1979 |

References

Grutzmacher and Schubert, 1979
Grutzmacher, H.-F.; Schubert, R.,
Substituent effects in the mass spectra of benzoyl hetarenes,
Org. Mass Spectrom., 1979, 14, 567. [all data]