Thallium hydrotris(1-pyrazolyl)borate
- Formula: C9H10BN6Tl
- Molecular weight: 417.410
- IUPAC Standard InChIKey: DJBVFSAJVSBPBR-UHFFFAOYSA-N
- CAS Registry Number: 34269-45-9
- Chemical structure:
View 3d structure (requires JavaScript / HTML 5) - Permanent link for this species. Use this link for bookmarking this species for future reference.

Gas phase ion energetics data

Data compiled by: Sharon G. Lias, Rhoda D. Levin, and Sherif A. Kafafi
Ionization energy determinations
IE (eV) | Method | Reference | Comment |
---|---|---|---|
8.15 | PE | Bruno, Ciliberto, et al., 1981 | |
8.40 | PE | Bruno, Ciliberto, et al., 1981 | Vertical value |

References

Bruno, Ciliberto, et al., 1981
Bruno, G.; Ciliberto, E.; Fragala, I.; Granozzi, G.,
The electronic structure of hydrotris(1-pyrazolyl)borate ligand by He-I and He-II photoelectron spectroscopy,
Inorg. Chim. Acta, 1981, 48, 61. [all data]