Bibenzyl, 3-chloro-
- Formula: C14H13Cl
- Molecular weight: 216.706
- IUPAC Standard InChIKey: NWVGKFZMBBPAJL-UHFFFAOYSA-N
- CAS Registry Number: 34176-92-6
- Chemical structure:
View 3d structure (requires JavaScript / HTML 5) - Other names: 1-Chloro-3-(2-phenylethyl)benzene; 1-(3-Chlorophenyl)-2-phenylethane

Gas phase ion energetics data

Data compiled by: Henry M. Rosenstock, Keith Draxl, Bruce W. Steiner, and John T. Herron
Ionization energy determinations
IE (eV) | Method | Reference |
---|---|---|
8.7 ± 0.1 | EI | McLafferty, Wachs, et al., 1970 |
Appearance energy determinations
Ion | AE (eV) | Other Products | Method | Reference | Comment |
---|---|---|---|---|---|
C7H6Cl+ | ~13. | ? | EI | McLafferty, Wachs, et al., 1970 | |
C7H7+ | 10.4 ± 0.2 | ? | EI | McLafferty, Wachs, et al., 1970 |

References

McLafferty, Wachs, et al., 1970
McLafferty, F.W.; Wachs, T.; Lifshitz, C.; Innorta, G.; Irving, P.,
Substituent effects in unimolecular ion decompositions. XV. Mechanistic interpretations and the quasi-equilibrium theory,
J. Am. Chem. Soc., 1970, 92, 6867. [all data]