Benzonitrile, m-phenethyl-
- Formula: C15H13N
- Molecular weight: 207.2704
- IUPAC Standard InChIKey: YAGSUWLZZOQMMN-UHFFFAOYSA-N
- CAS Registry Number: 34176-91-5
- Chemical structure:
View 3d structure (requires JavaScript / HTML 5) - Other names: 3-(2-Phenylethyl)benzonitrile; 1-(3-Cyanophenyl)-2-phenylethane

Gas phase ion energetics data

Data compiled by: Henry M. Rosenstock, Keith Draxl, Bruce W. Steiner, and John T. Herron
Ionization energy determinations
IE (eV) | Method | Reference |
---|---|---|
8.9 ± 0.1 | EI | McLafferty, Wachs, et al., 1970 |
Appearance energy determinations
Ion | AE (eV) | Other Products | Method | Reference | Comment |
---|---|---|---|---|---|
C7H7+ | 10.3 ± 0.2 | ? | EI | McLafferty, Wachs, et al., 1970 | |
C8H6N+ | ~15. | ? | EI | McLafferty, Wachs, et al., 1970 |

References

McLafferty, Wachs, et al., 1970
McLafferty, F.W.; Wachs, T.; Lifshitz, C.; Innorta, G.; Irving, P.,
Substituent effects in unimolecular ion decompositions. XV. Mechanistic interpretations and the quasi-equilibrium theory,
J. Am. Chem. Soc., 1970, 92, 6867. [all data]