Tetrakis(trimethylsilylmethyl)titanium
- Formula: C16H44Si4Ti
- Molecular weight: 396.730
- IUPAC Standard InChIKey: AGGOIKBQTWCNMG-UHFFFAOYSA-N
- CAS Registry Number: 33948-28-6
- Chemical structure:
View 3d structure (requires JavaScript / HTML 5) - Permanent link for this species. Use this link for bookmarking this species for future reference.

Gas phase thermochemistry data

Data compiled by: José A. Martinho Simões
Quantity | Value | Units | Method | Reference | Comment |
---|---|---|---|---|---|
ΔfH°gas | -684. ± 17. | kJ/mol | Review | Martinho Simões | The enthalpy of formation relies on -1579.0 ± 3.9 kJ/mol for the enthalpy of formation of Ti(O-i-Pr)4(l) |

Condensed phase thermochemistry data

Data compiled by: José A. Martinho Simões
Quantity | Value | Units | Method | Reference | Comment |
---|---|---|---|---|---|
ΔfH°liquid | -760. ± 15. | kJ/mol | Review | Martinho Simões | The enthalpy of formation relies on -1579.0 ± 3.9 kJ/mol for the enthalpy of formation of Ti(O-i-Pr)4(l) |

Phase change data

Data compiled by: José A. Martinho Simões
Quantity | Value | Units | Method | Reference | Comment |
---|---|---|---|---|---|
ΔvapH° | 75.3 ± 8.4 | kJ/mol | RSC | Lappert, Patil, et al., 1975 |

Gas phase ion energetics data

Data compiled as indicated in comments:
LLK - Sharon G. Lias, Rhoda D. Levin, and Sherif A. Kafafi
Ionization energy determinations
IE (eV) | Method | Reference | Comment |
---|---|---|---|
8.0 | PE | Lappert, Pedley, et al., 1974 | LLK |
8.6 ± 0.1 | PE | Lappert, Pedley, et al., 1974 | Vertical value; LLK |

References

Martinho Simões
Martinho Simões, J.A.,
Private communication (see http://webbook.nist.gov/chemistry/om/). [all data]
Lappert, Patil, et al., 1975
Lappert, M.F.; Patil, D.S.; Pedley, J.B.,
J. Chem. Soc., Chem. Commun., 1975, 830.. [all data]
Lappert, Pedley, et al., 1974
Lappert, M.F.; Pedley, J.B.; Sharp, G.,
Bonding studies of transition metal complexes. I. He(I) photoelectron spectra of d0 silylmethyl and neopentyl derivatives of Group IVA metals,
J. Organomet. Chem., 1974, 66, 271. [all data]