Propanamide, N,N-diethyl-2-methyl-
- Formula: C8H17NO
- Molecular weight: 143.2267
- IUPAC Standard InChIKey: CLJWSVLSCYWCMP-UHFFFAOYSA-N
- CAS Registry Number: 33931-44-1
- Chemical structure:
View 3d structure (requires JavaScript / HTML 5) - Permanent link for this species. Use this link for bookmarking this species for future reference.

Gas phase ion energetics data

Data compiled by: Sharon G. Lias, Rhoda D. Levin, and Sherif A. Kafafi
Ionization energy determinations
IE (eV) | Method | Reference | Comment |
---|---|---|---|
8.80 | PE | Domelsmith, Munchausen, et al., 1977 | Vertical value |

References

Domelsmith, Munchausen, et al., 1977
Domelsmith, L.N.; Munchausen, L.L.; Houk, K.N.,
Photoelectron spectra of psychotropic drugs. 1. Phenethylamines, tryptamines, and LSD,
J. Am. Chem. Soc., 1977, 99, 4311. [all data]