3,5-Cyclohexadiene-1,2-dione, 3,5-bis(1,1-dimethylethyl)-
- Formula: C14H20O2
- Molecular weight: 220.3074
- IUPAC Standard InChIKey: NOUZOVBGCDDMSX-UHFFFAOYSA-N
- CAS Registry Number: 3383-21-9
- Chemical structure:
View 3d structure (requires JavaScript / HTML 5) - Other names: o-Benzoquinone, 3,5-di-tert-butyl-; 3,5-di-tert-Butyl-ortho-benzoquinone; 3,5-di-tert-Butyl-o-benzoquinone; 3,5-di-t-Butyl-o-benzoquinone; 3,5-Di-tert-butyl-1,2-benzoquinone; 3,5-Di-tert-butyl-o-quinone

Phase change data

Data compiled by: William E. Acree, Jr., James S. Chickos
Enthalpy of fusion
ΔfusH (kJ/mol) | Temperature (K) | Reference |
---|---|---|
26.53 | 387.9 | Fattahi, Kass, et al., 2005 |

Gas phase ion energetics data

Data compiled as indicated in comments:
LLK - Sharon G. Lias, Rhoda D. Levin, and Sherif A. Kafafi
B - John E. Bartmess
Electron affinity determinations
EA (eV) | Method | Reference | Comment |
---|---|---|---|
1.804 ± 0.087 | IMRE | Heinis, Chowdhury, et al., 1988 | Equilibria not as good as others in study; B |
Ionization energy determinations
IE (eV) | Method | Reference | Comment |
---|---|---|---|
8.81 | PE | Schang, Gleiter, et al., 1978 | Vertical value; LLK |

References

Fattahi, Kass, et al., 2005
Fattahi, Alireza; Kass, Steven R.; Liebman, Joel F.; Matos, M. Agostinha R.; Miranda, Margarida S.; Morais, Victor M.F.,
The Enthalpies of Formation of o -, m -, and p -Benzoquinone: Gas-Phase Ion Energetics, Combustion Calorimetry, and Quantum Chemical Computations Combined,
J. Am. Chem. Soc., 2005, 127, 16, 6116-6122, https://doi.org/10.1021/ja042612f
. [all data]
Heinis, Chowdhury, et al., 1988
Heinis, T.; Chowdhury, S.; Scott, S.L.; Kebarle, P.,
Electron Affinities of Benzo-, Naphtho-, and Anthraquinones Determined from Gas-Phase Equilibria Measurements,
J. Am. Chem. Soc., 1988, 110, 2, 400, https://doi.org/10.1021/ja00210a015
. [all data]
Schang, Gleiter, et al., 1978
Schang, P.; Gleiter, R.; Rieker, A.,
The He(I) photoelectron spectrum of cyclobutene-1,2-dione and o-benzoquinone,
Ber. Bunsen-Ges. Phys. Chem., 1978, 82, 629. [all data]
Stallings, et al., 1981
Stallings, M.D., et al.,
Inorg. Chem., 1981, 20, 2655. [all data]