Bicyclo[5.4.2]trideca-7,9,11,12-tetraene
- Formula: C13H16
- Molecular weight: 172.2661
- IUPAC Standard InChIKey: XRXWAKCPFJMTBC-VBKZNOIUSA-N
- CAS Registry Number: 33800-90-7
- Chemical structure:
View 3d structure (requires JavaScript / HTML 5) - Permanent link for this species. Use this link for bookmarking this species for future reference.

Gas phase ion energetics data

Data compiled by: Sharon G. Lias, Rhoda D. Levin, and Sherif A. Kafafi
Ionization energy determinations
IE (eV) | Method | Reference | Comment |
---|---|---|---|
8.2 | PE | Batich, Bischof, et al., 1973 | Vertical value |

References

Batich, Bischof, et al., 1973
Batich, C.; Bischof, P.; Heilbronner, E.,
The photoelectron spectra of cyclooctatetraene and its hydrogenated derivatives,
J. Electron Spectrosc. Relat. Phenom., 1973, 1, 333. [all data]