Benzene, 1,3-bis(2,2-dimethylpropyl)-2,4,5,6-tetramethyl-
- Formula: C20H34
- Molecular weight: 274.4840
- IUPAC Standard InChIKey: NSSMYFQUYITACG-UHFFFAOYSA-N
- CAS Registry Number: 33781-73-6
- Chemical structure:
View 3d structure (requires JavaScript / HTML 5) - Other names: Benzene, 1,2,3,5-tetramethyl-4,6-dineopentyl-; Dineopentylisodurene; 1,2,3,5-Tetramethyl-4,6-di(2,2-dimethylpropyl)benzene

Gas phase ion energetics data

Data compiled by: Sharon G. Lias, John E. Bartmess, Joel F. Liebman, John L. Holmes, Rhoda D. Levin, and W. Gary Mallard
Ionization energy determinations
IE (eV) | Method | Reference | Comment |
---|---|---|---|
7.72 | PE | Howell, Goncalves, et al., 1984 | Vertical value |

References

Howell, Goncalves, et al., 1984
Howell, J.O.; Goncalves, J.M.; Amatore, C.; Klasinc, L.; Wightman, R.M.; Kochi, J.K.,
Electron transfer from aromatic hydrocarbons and their π-complexes with metals. Comparison of the standard oxidation potentials and vertical ionization potentials,
J. Am. Chem. Soc., 1984, 106, 3968. [all data]