1,3,4-Hexatriene
- Formula: C6H8
- Molecular weight: 80.1277
- IUPAC Standard InChIKey: VZSDWRJYMYVVEU-UHFFFAOYSA-N
- CAS Registry Number: 33755-64-5
- Chemical structure:
View 3d structure (requires JavaScript / HTML 5) - Permanent link for this species. Use this link for bookmarking this species for future reference.

Phase change data

Data compiled by: Thermodynamics Research Center, NIST Boulder Laboratories, Chris Muzny director
Quantity | Value | Units | Method | Reference | Comment |
---|---|---|---|---|---|
Tboil | 387. | K | N/A | Von Auwers, 1923 | Uncertainty assigned by TRC = 5. K |

Gas phase ion energetics data

Data compiled as indicated in comments:
LLK - Sharon G. Lias, Rhoda D. Levin, and Sherif A. Kafafi
Ionization energy determinations
IE (eV) | Method | Reference | Comment |
---|---|---|---|
8.56 | PE | Delwiche, Praet, et al., 1979 | Vertical value; LLK |

References

Von Auwers, 1923
Von Auwers, K.,
The spectrochemistry of compounds with multiple conjugation,
J. Prakt. Chem., 1923, 105, 361. [all data]
Delwiche, Praet, et al., 1979
Delwiche, J.; Praet, M.-Th.; Caprace, G.; Franskin-Hubin, M.-J.; Natalis, P.; Collin, J.E.,
The HeI photoelectron spectra of methyl-substituted 1,2,4-pentatrienes (vinylallene),
J. Electron Spectrosc. Relat. Phenom., 1979, 16, 35. [all data]